{"text_format":"1","workbook":"xlsx","n_sheets":26,"sheets":["Instructions","PW Instructions","1. General","2. Filing Type & Checklist","3. Group Info & Proposed Impact","4. Pure premium","4.1 Pure premium","4.2 Pure premium","4.3 Pure premium","4.4 Pure premium","4.5 Pure premium","4.6 Pure premium","4.7 Pure premium","4.8 Pure premium","4.9 Pure premium","4.10 Pure premium","4.11 Pure premium","4.12 Pure premium","4.13 Pure premium","4.14 Pure premium","4.15 Pure premium","4.16 Pure premium","4.17 Pure premium","4.18 Pure premium","4.19 Pure premium","5. Rating Plans"],"not_rendered":{"charts":0,"images":0,"macros":1,"external_links":2,"defined_names":107,"comments":0,"pivot_tables":0},"unopened":[],"bounds":{"document_bytes":16777216,"sheet_cells":100000,"rows_first":2000,"rows_last":500,"rows_between":2000,"halvings":0,"cell_chars":16384,"cell_head_chars":4096},"cells_cut":0,"cells_raw":0,"read":"whole","date_system":"1900"}

{"sheet":"Instructions","index":0,"n_rows":34,"n_cols":5,"rows_kept":34,"cut":false,"hidden":false,"merged":[[23,2,23,14],[30,2,30,14],[29,2,29,14],[24,2,24,14],[22,2,22,14],[31,2,31,14],[32,2,32,14],[27,1,27,14],[33,1,33,14],[25,3,25,14],[26,1,26,14],[28,2,28,14],[14,1,14,14],[15,2,15,14],[21,2,21,14],[20,1,20,14],[18,2,18,14],[17,2,17,14],[19,2,19,14],[16,2,16,14],[0,0,0,14],[1,1,1,14],[2,1,2,14],[3,1,3,14],[13,2,13,14],[8,2,8,14],[11,3,11,14],[4,2,4,14],[6,3,6,14],[5,3,5,14],[7,3,7,14],[9,3,9,14],[10,4,10,14],[12,3,12,14]]}
["Instructions for Completing the Workers' Compensation\nRate Application"]
["1)","In the Workers' Compensation Rate Application, areas of insurer input are generally identified with blue font text, light blue background,\nand/or light blue outlined boxes."]
["2)","Should a model be in use, fill in and submit the Model Checklist and Model Disclosure forms that are provided on SERFF."]
["3)","Insurers must submit the following for all filing types:\n"]
[null,"Ø"," A Memorandum which details the following information:"]
[null,null,"• ","All proposed changes being made to each company or companies in the group"]
{"$rows_left_out":29}
{"sheet":"PW Instructions","index":1,"n_rows":23,"n_cols":4,"rows_kept":23,"cut":false,"hidden":false,"merged":[[13,1,13,14],[0,0,0,14],[1,1,1,14],[2,1,2,14],[3,1,3,14],[4,2,4,14],[5,2,5,14],[21,1,21,14],[22,1,22,14],[6,1,6,14],[7,2,7,14],[9,2,9,14],[11,2,11,14],[12,0,12,14],[17,2,17,14],[14,2,14,14],[15,3,15,14],[18,2,18,14],[20,3,20,14],[19,2,19,14],[16,2,16,14],[8,2,8,14],[10,1,10,14]]}
["For Program Withdrawal Only"]
[null,"A Program Withdrawal (PW) occurs when an insurer ceases all underwriting and operational activities for a specific insurance program. This process involves discontinuing the sale of new policies and non-renewing all existing policies upon their expiration.  A PW filing is required as the currently filed program will no longer utilize all rates and supplementary rate information necessary to determine the applicable premium for an insured.  The rates may be inadequate and/or unfairly discriminatory (CIC §11730(j), §11732, §11732.5, §11735(a)). "]
[null,"There are three distinct circumstances under which an insurer may initiate a PW, all of which require submission of a PW filing:"]
["1)","Withdrawal of a Program with No In-Force Policies"]
[null,"a) ","No business has ever been written under the program, or"]
[null,"b) ","Business was previously written, but there are currently no in-force policies or premiums in the program"]
{"$rows_left_out":18}
{"sheet":"1. General","index":2,"n_rows":29,"n_cols":14,"rows_kept":29,"cut":false,"hidden":false,"merged":[[14,3,14,6],[18,3,18,7],[19,8,19,9],[17,3,17,7],[16,3,16,7],[15,3,15,6],[27,0,27,4],[20,6,20,7],[22,6,22,8],[23,6,23,8],[24,1,26,4],[24,6,24,8],[7,3,7,4],[8,3,8,4],[10,3,10,4],[13,3,13,6],[12,3,12,6],[2,0,2,12],[4,0,4,4],[5,3,5,9],[6,3,6,9],[1,0,1,12]]}
[]
["CALIFORNIA DEPARTMENT OF INSURANCE"]
["WORKERS' COMPENSATION RATE APPLICATION"]
[]
["Company Information"]
["Company Name:"]
{"$rows_left_out":24}
{"sheet":"2. Filing Type & Checklist","index":3,"n_rows":91,"n_cols":15,"rows_kept":91,"cut":false,"hidden":false,"merged":[[0,6,0,12],[5,8,6,12],[15,0,15,12],[61,2,61,5],[4,0,4,10],[1,6,1,7],[10,2,10,4],[1,8,1,12]]}
["CALIFORNIA DEPARTMENT OF INSURANCE",null,null,null,null,null,"WORKERS’ COMPENSATION RATE APPLICATION"]
[null,null,null,null,null,null,"Company Name:",null,{"$f":"[0]!Co_Name","v":0}]
[]
["FILING TYPE"]
["Complete the following questions in order to generate the filing checklist:\nSelect Y (yes) or N (no) for each of the dropdowns."]
["1. Is this a New Program filing?",null,null,null,null,null,null,null,{"$f":"IF($H$6 =\"Y\",\"(New Program filing type selected. Mark 'N' for the other filing types and move on to Filing Checklist field below)\",\"\")","v":""},null,null,null,null,{"$f":"IF(OR(H6=\"Y\", H7=\"Y\", H12=\"Y\"), \"\", IF(SUM(COUNTIF(H6,\"N\"), COUNTIF(H7,\"N\"), COUNTIF(H12,\"N\"))>1, \"ERROR! You must select a filing type\", IF(SUM(COUNTIF(H6,\"\"), COUNTIF(H7,\"\"), COUNTIF(H12,\"\"))>1, \"ERROR! You must select a filing type\", \"\")))","v":"ERROR! You must select a filing type"}]
{"$rows_left_out":86}
{"sheet":"3. Group Info & Proposed Impact","index":4,"n_rows":34,"n_cols":8,"rows_kept":34,"cut":false,"hidden":true,"merged":[[1,5,1,6],[8,4,8,5],[6,0,6,6]]}
["CALIFORNIA DEPARTMENT OF INSURANCE",null,null,null,"WORKERS’ COMPENSATION RATE APPLICATION"]
[null,null,null,null,"Company Name:",{"$f":"[0]!Co_Name","v":0}]
[]
["INSURER GROUP INFORMATION AND IMPACT OF PROPOSED CHANGES"]
[]
[]
{"$rows_left_out":29}
{"sheet":"4. Pure premium","index":5,"n_rows":42,"n_cols":12,"rows_kept":42,"cut":false,"hidden":true,"merged":[[2,7,2,10],[5,1,6,10],[7,2,7,4],[7,7,7,8],[12,4,13,10],[9,8,9,9],[9,4,9,7],[15,2,18,10],[20,1,20,7],[20,8,20,9],[21,2,21,8],[22,2,22,4],[25,2,25,4],[22,8,22,9],[23,8,23,9],[24,8,24,9],[25,8,25,9],[14,4,14,10],[38,8,38,9],[34,8,34,9],[35,8,35,9],[36,8,36,9],[32,2,32,5],[35,2,35,4],[34,2,34,7],[26,2,27,5],[28,2,28,5],[29,2,31,10],[32,8,32,9],[33,8,33,9],[26,8,26,9],[23,2,23,4],[24,2,24,4]]}
[]
["CALIFORNIA DEPARTMENT OF INSURANCE",null,null,null,null,"WORKERS’ COMPENSATION RATE APPLICATION"]
[null,null,null,null,null,"Company Name:",null,{"$f":"'3. Group Info & Proposed Impact'!B11","v":0}]
[]
["Pure Premium Rate Filings"]
["A. ","Pure Premium Rates and Deviations (Complete A.1 or A.2, or both. Permits deviation from the advisory Loss & LAE provisions.)"]
{"$rows_left_out":37}
{"sheet":"4.1 Pure premium","index":6,"n_rows":42,"n_cols":12,"rows_kept":42,"cut":false,"hidden":true,"merged":[[36,8,36,9],[38,8,38,9],[32,2,32,5],[32,8,32,9],[33,8,33,9],[34,2,34,7],[34,8,34,9],[35,2,35,4],[35,8,35,9],[29,2,31,10],[22,2,22,4],[22,8,22,9],[23,2,23,4],[23,8,23,9],[24,2,24,4],[24,8,24,9],[25,2,25,4],[25,8,25,9],[26,2,27,5],[26,8,26,9],[28,2,28,5],[21,2,21,8],[2,7,2,10],[5,1,6,10],[7,2,7,4],[7,7,7,8],[9,4,9,7],[9,8,9,9],[12,4,13,10],[14,4,14,10],[15,2,18,10],[20,1,20,7],[20,8,20,9]]}
[]
["CALIFORNIA DEPARTMENT OF INSURANCE",null,null,null,null,"WORKERS’ COMPENSATION RATE APPLICATION"]
[null,null,null,null,null,"Company Name:",null,{"$f":"'3. Group Info & Proposed Impact'!B12","v":0}]
[]
["Pure Premium Rate Filings"]
["A. ","Pure Premium Rates and Deviations (Complete A.1 or A.2, or both. Permits deviation from the advisory Loss & LAE provisions.)"]
{"$rows_left_out":37}
{"sheet":"4.2 Pure premium","index":7,"n_rows":42,"n_cols":12,"rows_kept":42,"cut":false,"hidden":true,"merged":[[36,8,36,9],[38,8,38,9],[32,2,32,5],[32,8,32,9],[33,8,33,9],[34,2,34,7],[34,8,34,9],[35,2,35,4],[35,8,35,9],[29,2,31,10],[22,2,22,4],[22,8,22,9],[23,2,23,4],[23,8,23,9],[24,2,24,4],[24,8,24,9],[25,2,25,4],[25,8,25,9],[26,2,27,5],[26,8,26,9],[28,2,28,5],[21,2,21,8],[2,7,2,10],[5,1,6,10],[7,2,7,4],[7,7,7,8],[9,4,9,7],[9,8,9,9],[12,4,13,10],[14,4,14,10],[15,2,18,10],[20,1,20,7],[20,8,20,9]]}
[]
["CALIFORNIA DEPARTMENT OF INSURANCE",null,null,null,null,"WORKERS’ COMPENSATION RATE APPLICATION"]
[null,null,null,null,null,"Company Name:",null,{"$f":"'3. Group Info & Proposed Impact'!B13","v":0}]
[]
["Pure Premium Rate Filings"]
["A. ","Pure Premium Rates and Deviations (Complete A.1 or A.2, or both. Permits deviation from the advisory Loss & LAE provisions.)"]
{"$rows_left_out":37}
{"sheet":"4.3 Pure premium","index":8,"n_rows":42,"n_cols":12,"rows_kept":42,"cut":false,"hidden":true,"merged":[[36,8,36,9],[38,8,38,9],[32,2,32,5],[32,8,32,9],[33,8,33,9],[34,2,34,7],[34,8,34,9],[35,2,35,4],[35,8,35,9],[29,2,31,10],[22,2,22,4],[22,8,22,9],[23,2,23,4],[23,8,23,9],[24,2,24,4],[24,8,24,9],[25,2,25,4],[25,8,25,9],[26,2,27,5],[26,8,26,9],[28,2,28,5],[21,2,21,8],[2,7,2,10],[5,1,6,10],[7,2,7,4],[7,7,7,8],[9,4,9,7],[9,8,9,9],[12,4,13,10],[14,4,14,10],[15,2,18,10],[20,1,20,7],[20,8,20,9]]}
[]
["CALIFORNIA DEPARTMENT OF INSURANCE",null,null,null,null,"WORKERS’ COMPENSATION RATE APPLICATION"]
[null,null,null,null,null,"Company Name:",null,{"$f":"'3. Group Info & Proposed Impact'!B14","v":0}]
[]
["Pure Premium Rate Filings"]
["A. ","Pure Premium Rates and Deviations (Complete A.1 or A.2, or both. Permits deviation from the advisory Loss & LAE provisions.)"]
{"$rows_left_out":37}
{"sheet":"4.4 Pure premium","index":9,"n_rows":42,"n_cols":12,"rows_kept":42,"cut":false,"hidden":true,"merged":[[36,8,36,9],[38,8,38,9],[32,2,32,5],[32,8,32,9],[33,8,33,9],[34,2,34,7],[34,8,34,9],[35,2,35,4],[35,8,35,9],[29,2,31,10],[22,2,22,4],[22,8,22,9],[23,2,23,4],[23,8,23,9],[24,2,24,4],[24,8,24,9],[25,2,25,4],[25,8,25,9],[26,2,27,5],[26,8,26,9],[28,2,28,5],[21,2,21,8],[2,7,2,10],[5,1,6,10],[7,2,7,4],[7,7,7,8],[9,4,9,7],[9,8,9,9],[12,4,13,10],[14,4,14,10],[15,2,18,10],[20,1,20,7],[20,8,20,9]]}
[]
["CALIFORNIA DEPARTMENT OF INSURANCE",null,null,null,null,"WORKERS’ COMPENSATION RATE APPLICATION"]
[null,null,null,null,null,"Company Name:",null,{"$f":"'3. Group Info & Proposed Impact'!B15","v":0}]
[]
["Pure Premium Rate Filings"]
["A. ","Pure Premium Rates and Deviations (Complete A.1 or A.2, or both. Permits deviation from the advisory Loss & LAE provisions.)"]
{"$rows_left_out":37}
{"sheet":"4.5 Pure premium","index":10,"n_rows":42,"n_cols":12,"rows_kept":42,"cut":false,"hidden":true,"merged":[[36,8,36,9],[38,8,38,9],[32,2,32,5],[32,8,32,9],[33,8,33,9],[34,2,34,7],[34,8,34,9],[35,2,35,4],[35,8,35,9],[29,2,31,10],[22,2,22,4],[22,8,22,9],[23,2,23,4],[23,8,23,9],[24,2,24,4],[24,8,24,9],[25,2,25,4],[25,8,25,9],[26,2,27,5],[26,8,26,9],[28,2,28,5],[21,2,21,8],[2,7,2,10],[5,1,6,10],[7,2,7,4],[7,7,7,8],[9,4,9,7],[9,8,9,9],[12,4,13,10],[14,4,14,10],[15,2,18,10],[20,1,20,7],[20,8,20,9]]}
[]
["CALIFORNIA DEPARTMENT OF INSURANCE",null,null,null,null,"WORKERS’ COMPENSATION RATE APPLICATION"]
[null,null,null,null,null,"Company Name:",null,{"$f":"'3. Group Info & Proposed Impact'!B16","v":0}]
[]
["Pure Premium Rate Filings"]
["A. ","Pure Premium Rates and Deviations (Complete A.1 or A.2, or both. Permits deviation from the advisory Loss & LAE provisions.)"]
{"$rows_left_out":37}
{"sheet":"4.6 Pure premium","index":11,"n_rows":42,"n_cols":12,"rows_kept":42,"cut":false,"hidden":true,"merged":[[36,8,36,9],[38,8,38,9],[32,2,32,5],[32,8,32,9],[33,8,33,9],[34,2,34,7],[34,8,34,9],[35,2,35,4],[35,8,35,9],[29,2,31,10],[22,2,22,4],[22,8,22,9],[23,2,23,4],[23,8,23,9],[24,2,24,4],[24,8,24,9],[25,2,25,4],[25,8,25,9],[26,2,27,5],[26,8,26,9],[28,2,28,5],[21,2,21,8],[2,7,2,10],[5,1,6,10],[7,2,7,4],[7,7,7,8],[9,4,9,7],[9,8,9,9],[12,4,13,10],[14,4,14,10],[15,2,18,10],[20,1,20,7],[20,8,20,9]]}
[]
["CALIFORNIA DEPARTMENT OF INSURANCE",null,null,null,null,"WORKERS’ COMPENSATION RATE APPLICATION"]
[null,null,null,null,null,"Company Name:",null,{"$f":"'3. Group Info & Proposed Impact'!B17","v":0}]
[]
["Pure Premium Rate Filings"]
["A. ","Pure Premium Rates and Deviations (Complete A.1 or A.2, or both. Permits deviation from the advisory Loss & LAE provisions.)"]
{"$rows_left_out":37}
{"sheet":"4.7 Pure premium","index":12,"n_rows":42,"n_cols":12,"rows_kept":42,"cut":false,"hidden":true,"merged":[[36,8,36,9],[38,8,38,9],[32,2,32,5],[32,8,32,9],[33,8,33,9],[34,2,34,7],[34,8,34,9],[35,2,35,4],[35,8,35,9],[29,2,31,10],[22,2,22,4],[22,8,22,9],[23,2,23,4],[23,8,23,9],[24,2,24,4],[24,8,24,9],[25,2,25,4],[25,8,25,9],[26,2,27,5],[26,8,26,9],[28,2,28,5],[21,2,21,8],[2,7,2,10],[5,1,6,10],[7,2,7,4],[7,7,7,8],[9,4,9,7],[9,8,9,9],[12,4,13,10],[14,4,14,10],[15,2,18,10],[20,1,20,7],[20,8,20,9]]}
[]
["CALIFORNIA DEPARTMENT OF INSURANCE",null,null,null,null,"WORKERS’ COMPENSATION RATE APPLICATION"]
[null,null,null,null,null,"Company Name:",null,{"$f":"'3. Group Info & Proposed Impact'!B18","v":0}]
[]
["Pure Premium Rate Filings"]
["A. ","Pure Premium Rates and Deviations (Complete A.1 or A.2, or both. Permits deviation from the advisory Loss & LAE provisions.)"]
{"$rows_left_out":37}
{"sheet":"4.8 Pure premium","index":13,"n_rows":42,"n_cols":12,"rows_kept":42,"cut":false,"hidden":true,"merged":[[36,8,36,9],[38,8,38,9],[32,2,32,5],[32,8,32,9],[33,8,33,9],[34,2,34,7],[34,8,34,9],[35,2,35,4],[35,8,35,9],[29,2,31,10],[22,2,22,4],[22,8,22,9],[23,2,23,4],[23,8,23,9],[24,2,24,4],[24,8,24,9],[25,2,25,4],[25,8,25,9],[26,2,27,5],[26,8,26,9],[28,2,28,5],[21,2,21,8],[2,7,2,10],[5,1,6,10],[7,2,7,4],[7,7,7,8],[9,4,9,7],[9,8,9,9],[12,4,13,10],[14,4,14,10],[15,2,18,10],[20,1,20,7],[20,8,20,9]]}
[]
["CALIFORNIA DEPARTMENT OF INSURANCE",null,null,null,null,"WORKERS’ COMPENSATION RATE APPLICATION"]
[null,null,null,null,null,"Company Name:",null,{"$f":"'3. Group Info & Proposed Impact'!B19","v":0}]
[]
["Pure Premium Rate Filings"]
["A. ","Pure Premium Rates and Deviations (Complete A.1 or A.2, or both. Permits deviation from the advisory Loss & LAE provisions.)"]
{"$rows_left_out":37}
{"sheet":"4.9 Pure premium","index":14,"n_rows":42,"n_cols":12,"rows_kept":42,"cut":false,"hidden":true,"merged":[[36,8,36,9],[38,8,38,9],[32,2,32,5],[32,8,32,9],[33,8,33,9],[34,2,34,7],[34,8,34,9],[35,2,35,4],[35,8,35,9],[29,2,31,10],[22,2,22,4],[22,8,22,9],[23,2,23,4],[23,8,23,9],[24,2,24,4],[24,8,24,9],[25,2,25,4],[25,8,25,9],[26,2,27,5],[26,8,26,9],[28,2,28,5],[21,2,21,8],[2,7,2,10],[5,1,6,10],[7,2,7,4],[7,7,7,8],[9,4,9,7],[9,8,9,9],[12,4,13,10],[14,4,14,10],[15,2,18,10],[20,1,20,7],[20,8,20,9]]}
[]
["CALIFORNIA DEPARTMENT OF INSURANCE",null,null,null,null,"WORKERS’ COMPENSATION RATE APPLICATION"]
[null,null,null,null,null,"Company Name:",null,{"$f":"'3. Group Info & Proposed Impact'!B20","v":0}]
[]
["Pure Premium Rate Filings"]
["A. ","Pure Premium Rates and Deviations (Complete A.1 or A.2, or both. Permits deviation from the advisory Loss & LAE provisions.)"]
{"$rows_left_out":37}
{"sheet":"4.10 Pure premium","index":15,"n_rows":42,"n_cols":12,"rows_kept":42,"cut":false,"hidden":true,"merged":[[36,8,36,9],[38,8,38,9],[32,2,32,5],[32,8,32,9],[33,8,33,9],[34,2,34,7],[34,8,34,9],[35,2,35,4],[35,8,35,9],[29,2,31,10],[22,2,22,4],[22,8,22,9],[23,2,23,4],[23,8,23,9],[24,2,24,4],[24,8,24,9],[25,2,25,4],[25,8,25,9],[26,2,27,5],[26,8,26,9],[28,2,28,5],[21,2,21,8],[2,7,2,10],[5,1,6,10],[7,2,7,4],[7,7,7,8],[9,4,9,7],[9,8,9,9],[12,4,13,10],[14,4,14,10],[15,2,18,10],[20,1,20,7],[20,8,20,9]]}
[]
["CALIFORNIA DEPARTMENT OF INSURANCE",null,null,null,null,"WORKERS’ COMPENSATION RATE APPLICATION"]
[null,null,null,null,null,"Company Name:",null,{"$f":"'3. Group Info & Proposed Impact'!B21","v":0}]
[]
["Pure Premium Rate Filings"]
["A. ","Pure Premium Rates and Deviations (Complete A.1 or A.2, or both. Permits deviation from the advisory Loss & LAE provisions.)"]
{"$rows_left_out":37}
{"sheet":"4.11 Pure premium","index":16,"n_rows":42,"n_cols":12,"rows_kept":42,"cut":false,"hidden":true,"merged":[[36,8,36,9],[38,8,38,9],[32,2,32,5],[32,8,32,9],[33,8,33,9],[34,2,34,7],[34,8,34,9],[35,2,35,4],[35,8,35,9],[29,2,31,10],[22,2,22,4],[22,8,22,9],[23,2,23,4],[23,8,23,9],[24,2,24,4],[24,8,24,9],[25,2,25,4],[25,8,25,9],[26,2,27,5],[26,8,26,9],[28,2,28,5],[21,2,21,8],[2,7,2,10],[5,1,6,10],[7,2,7,4],[7,7,7,8],[9,4,9,7],[9,8,9,9],[12,4,13,10],[14,4,14,10],[15,2,18,10],[20,1,20,7],[20,8,20,9]]}
[]
["CALIFORNIA DEPARTMENT OF INSURANCE",null,null,null,null,"WORKERS’ COMPENSATION RATE APPLICATION"]
[null,null,null,null,null,"Company Name:",null,{"$f":"'3. Group Info & Proposed Impact'!B22","v":0}]
[]
["Pure Premium Rate Filings"]
["A. ","Pure Premium Rates and Deviations (Complete A.1 or A.2, or both. Permits deviation from the advisory Loss & LAE provisions.)"]
{"$rows_left_out":37}
{"sheet":"4.12 Pure premium","index":17,"n_rows":42,"n_cols":12,"rows_kept":42,"cut":false,"hidden":true,"merged":[[36,8,36,9],[38,8,38,9],[32,2,32,5],[32,8,32,9],[33,8,33,9],[34,2,34,7],[34,8,34,9],[35,2,35,4],[35,8,35,9],[29,2,31,10],[22,2,22,4],[22,8,22,9],[23,2,23,4],[23,8,23,9],[24,2,24,4],[24,8,24,9],[25,2,25,4],[25,8,25,9],[26,2,27,5],[26,8,26,9],[28,2,28,5],[21,2,21,8],[2,7,2,10],[5,1,6,10],[7,2,7,4],[7,7,7,8],[9,4,9,7],[9,8,9,9],[12,4,13,10],[14,4,14,10],[15,2,18,10],[20,1,20,7],[20,8,20,9]]}
[]
["CALIFORNIA DEPARTMENT OF INSURANCE",null,null,null,null,"WORKERS’ COMPENSATION RATE APPLICATION"]
[null,null,null,null,null,"Company Name:",null,{"$f":"'3. Group Info & Proposed Impact'!B23","v":0}]
[]
["Pure Premium Rate Filings"]
["A. ","Pure Premium Rates and Deviations (Complete A.1 or A.2, or both. Permits deviation from the advisory Loss & LAE provisions.)"]
{"$rows_left_out":37}
{"sheet":"4.13 Pure premium","index":18,"n_rows":42,"n_cols":12,"rows_kept":42,"cut":false,"hidden":true,"merged":[[36,8,36,9],[38,8,38,9],[32,2,32,5],[32,8,32,9],[33,8,33,9],[34,2,34,7],[34,8,34,9],[35,2,35,4],[35,8,35,9],[29,2,31,10],[22,2,22,4],[22,8,22,9],[23,2,23,4],[23,8,23,9],[24,2,24,4],[24,8,24,9],[25,2,25,4],[25,8,25,9],[26,2,27,5],[26,8,26,9],[28,2,28,5],[21,2,21,8],[2,7,2,10],[5,1,6,10],[7,2,7,4],[7,7,7,8],[9,4,9,7],[9,8,9,9],[12,4,13,10],[14,4,14,10],[15,2,18,10],[20,1,20,7],[20,8,20,9]]}
[]
["CALIFORNIA DEPARTMENT OF INSURANCE",null,null,null,null,"WORKERS’ COMPENSATION RATE APPLICATION"]
[null,null,null,null,null,"Company Name:",null,{"$f":"'3. Group Info & Proposed Impact'!B24","v":0}]
[]
["Pure Premium Rate Filings"]
["A. ","Pure Premium Rates and Deviations (Complete A.1 or A.2, or both. Permits deviation from the advisory Loss & LAE provisions.)"]
{"$rows_left_out":37}
{"sheet":"4.14 Pure premium","index":19,"n_rows":42,"n_cols":12,"rows_kept":42,"cut":false,"hidden":true,"merged":[[36,8,36,9],[38,8,38,9],[32,2,32,5],[32,8,32,9],[33,8,33,9],[34,2,34,7],[34,8,34,9],[35,2,35,4],[35,8,35,9],[29,2,31,10],[22,2,22,4],[22,8,22,9],[23,2,23,4],[23,8,23,9],[24,2,24,4],[24,8,24,9],[25,2,25,4],[25,8,25,9],[26,2,27,5],[26,8,26,9],[28,2,28,5],[21,2,21,8],[2,7,2,10],[5,1,6,10],[7,2,7,4],[7,7,7,8],[9,4,9,7],[9,8,9,9],[12,4,13,10],[14,4,14,10],[15,2,18,10],[20,1,20,7],[20,8,20,9]]}
[]
["CALIFORNIA DEPARTMENT OF INSURANCE",null,null,null,null,"WORKERS’ COMPENSATION RATE APPLICATION"]
[null,null,null,null,null,"Company Name:",null,{"$f":"'3. Group Info & Proposed Impact'!B25","v":0}]
[]
["Pure Premium Rate Filings"]
["A. ","Pure Premium Rates and Deviations (Complete A.1 or A.2, or both. Permits deviation from the advisory Loss & LAE provisions.)"]
{"$rows_left_out":37}
{"sheet":"4.15 Pure premium","index":20,"n_rows":42,"n_cols":12,"rows_kept":42,"cut":false,"hidden":true,"merged":[[36,8,36,9],[38,8,38,9],[32,2,32,5],[32,8,32,9],[33,8,33,9],[34,2,34,7],[34,8,34,9],[35,2,35,4],[35,8,35,9],[29,2,31,10],[22,2,22,4],[22,8,22,9],[23,2,23,4],[23,8,23,9],[24,2,24,4],[24,8,24,9],[25,2,25,4],[25,8,25,9],[26,2,27,5],[26,8,26,9],[28,2,28,5],[21,2,21,8],[2,7,2,10],[5,1,6,10],[7,2,7,4],[7,7,7,8],[9,4,9,7],[9,8,9,9],[12,4,13,10],[14,4,14,10],[15,2,18,10],[20,1,20,7],[20,8,20,9]]}
[]
["CALIFORNIA DEPARTMENT OF INSURANCE",null,null,null,null,"WORKERS’ COMPENSATION RATE APPLICATION"]
[null,null,null,null,null,"Company Name:",null,{"$f":"'3. Group Info & Proposed Impact'!B26","v":0}]
[]
["Pure Premium Rate Filings"]
["A. ","Pure Premium Rates and Deviations (Complete A.1 or A.2, or both. Permits deviation from the advisory Loss & LAE provisions.)"]
{"$rows_left_out":37}
{"sheet":"4.16 Pure premium","index":21,"n_rows":42,"n_cols":12,"rows_kept":42,"cut":false,"hidden":true,"merged":[[36,8,36,9],[38,8,38,9],[32,2,32,5],[32,8,32,9],[33,8,33,9],[34,2,34,7],[34,8,34,9],[35,2,35,4],[35,8,35,9],[29,2,31,10],[22,2,22,4],[22,8,22,9],[23,2,23,4],[23,8,23,9],[24,2,24,4],[24,8,24,9],[25,2,25,4],[25,8,25,9],[26,2,27,5],[26,8,26,9],[28,2,28,5],[21,2,21,8],[2,7,2,10],[5,1,6,10],[7,2,7,4],[7,7,7,8],[9,4,9,7],[9,8,9,9],[12,4,13,10],[14,4,14,10],[15,2,18,10],[20,1,20,7],[20,8,20,9]]}
[]
["CALIFORNIA DEPARTMENT OF INSURANCE",null,null,null,null,"WORKERS’ COMPENSATION RATE APPLICATION"]
[null,null,null,null,null,"Company Name:",null,{"$f":"'3. Group Info & Proposed Impact'!B27","v":0}]
[]
["Pure Premium Rate Filings"]
["A. ","Pure Premium Rates and Deviations (Complete A.1 or A.2, or both. Permits deviation from the advisory Loss & LAE provisions.)"]
{"$rows_left_out":37}
{"sheet":"4.17 Pure premium","index":22,"n_rows":42,"n_cols":12,"rows_kept":42,"cut":false,"hidden":true,"merged":[[36,8,36,9],[38,8,38,9],[32,2,32,5],[32,8,32,9],[33,8,33,9],[34,2,34,7],[34,8,34,9],[35,2,35,4],[35,8,35,9],[29,2,31,10],[22,2,22,4],[22,8,22,9],[23,2,23,4],[23,8,23,9],[24,2,24,4],[24,8,24,9],[25,2,25,4],[25,8,25,9],[26,2,27,5],[26,8,26,9],[28,2,28,5],[21,2,21,8],[2,7,2,10],[5,1,6,10],[7,2,7,4],[7,7,7,8],[9,4,9,7],[9,8,9,9],[12,4,13,10],[14,4,14,10],[15,2,18,10],[20,1,20,7],[20,8,20,9]]}
[]
["CALIFORNIA DEPARTMENT OF INSURANCE",null,null,null,null,"WORKERS’ COMPENSATION RATE APPLICATION"]
[null,null,null,null,null,"Company Name:",null,{"$f":"'3. Group Info & Proposed Impact'!B28","v":0}]
[]
["Pure Premium Rate Filings"]
["A. ","Pure Premium Rates and Deviations (Complete A.1 or A.2, or both. Permits deviation from the advisory Loss & LAE provisions.)"]
{"$rows_left_out":37}
{"sheet":"4.18 Pure premium","index":23,"n_rows":42,"n_cols":12,"rows_kept":42,"cut":false,"hidden":true,"merged":[[36,8,36,9],[38,8,38,9],[32,2,32,5],[32,8,32,9],[33,8,33,9],[34,2,34,7],[34,8,34,9],[35,2,35,4],[35,8,35,9],[29,2,31,10],[22,2,22,4],[22,8,22,9],[23,2,23,4],[23,8,23,9],[24,2,24,4],[24,8,24,9],[25,2,25,4],[25,8,25,9],[26,2,27,5],[26,8,26,9],[28,2,28,5],[21,2,21,8],[2,7,2,10],[5,1,6,10],[7,2,7,4],[7,7,7,8],[9,4,9,7],[9,8,9,9],[12,4,13,10],[14,4,14,10],[15,2,18,10],[20,1,20,7],[20,8,20,9]]}
[]
["CALIFORNIA DEPARTMENT OF INSURANCE",null,null,null,null,"WORKERS’ COMPENSATION RATE APPLICATION"]
[null,null,null,null,null,"Company Name:",null,{"$f":"'3. Group Info & Proposed Impact'!B29","v":0}]
[]
["Pure Premium Rate Filings"]
["A. ","Pure Premium Rates and Deviations (Complete A.1 or A.2, or both. Permits deviation from the advisory Loss & LAE provisions.)"]
{"$rows_left_out":37}
{"sheet":"4.19 Pure premium","index":24,"n_rows":42,"n_cols":12,"rows_kept":42,"cut":false,"hidden":true,"merged":[[36,8,36,9],[38,8,38,9],[32,2,32,5],[32,8,32,9],[33,8,33,9],[34,2,34,7],[34,8,34,9],[35,2,35,4],[35,8,35,9],[29,2,31,10],[22,2,22,4],[22,8,22,9],[23,2,23,4],[23,8,23,9],[24,2,24,4],[24,8,24,9],[25,2,25,4],[25,8,25,9],[26,2,27,5],[26,8,26,9],[28,2,28,5],[21,2,21,8],[2,7,2,10],[5,1,6,10],[7,2,7,4],[7,7,7,8],[9,4,9,7],[9,8,9,9],[12,4,13,10],[14,4,14,10],[15,2,18,10],[20,1,20,7],[20,8,20,9]]}
[]
["CALIFORNIA DEPARTMENT OF INSURANCE",null,null,null,null,"WORKERS’ COMPENSATION RATE APPLICATION"]
[null,null,null,null,null,"Company Name:",null,{"$f":"'3. Group Info & Proposed Impact'!B30","v":0}]
[]
["Pure Premium Rate Filings"]
["A. ","Pure Premium Rates and Deviations (Complete A.1 or A.2, or both. Permits deviation from the advisory Loss & LAE provisions.)"]
{"$rows_left_out":37}
{"sheet":"5. Rating Plans","index":25,"n_rows":62,"n_cols":14,"rows_kept":62,"cut":false,"hidden":false,"merged":[[45,2,48,9],[36,3,36,6],[2,7,2,11],[5,0,10,12]]}
[]
["CALIFORNIA DEPARTMENT OF INSURANCE",null,null,null,null,"WORKERS’ COMPENSATION RATE APPLICATION"]
[null,null,null,null,null,"Company Name:",null,{"$f":"[0]!Co_Name","v":0}]
[]
["1. New or Revised Rating Plans and Supplementary Rate Information"]
["For each new rating plan filing or revision, submit exhibits, manuals, and supporting documentation that explains how the plan applies and how the rates or factors in this plan will be applied. For each item checked in the left column, state the source of the plans in the right column. If your company is adopting by reference an unmodified WCIRB rating plan, do not submit a copy of the entire plan. Simply reference the Bureau plan below, and provide the expense related rating values used in computing the premiums. If there is more than one source code for the item(s), make a note in the memorandum with all codes that should be marked in this tab for the item(s)."]
{"$rows_left_out":56}