{"text_format":"1","workbook":"xlsx","n_sheets":24,"sheets":["Settings","References","Instructions","1.General","2.Group","3.Filing Type and Checklist","4.Proposed Impact","5.Reconciliation","6.Program Detail","7.Statutory Data","8.Miscellaneous Fees","9.Forms","10.Rules","11.Variance Request","12.1Model Disclosure","12.2Model Disclosure","12.3Model Disclosure","12.4Model Disclosure","12.5Model Disclosure","12.6Model Disclosure","12.7Model Disclosure","12.8Model Disclosure","12.9Model Disclosure","12.10Model Disclosure"],"not_rendered":{"charts":0,"images":0,"macros":1,"external_links":1,"defined_names":140,"comments":1,"pivot_tables":0},"unopened":[],"bounds":{"document_bytes":16777216,"sheet_cells":100000,"rows_first":2000,"rows_last":500,"rows_between":2000,"halvings":0,"cell_chars":16384,"cell_head_chars":4096},"cells_cut":0,"cells_raw":0,"read":"whole","date_system":"1900"}

{"sheet":"Settings","index":0,"n_rows":35,"n_cols":6,"rows_kept":35,"cut":false,"hidden":true,"merged":[]}
["For Department Use Only"]
[]
["Click button below to unprotect all sheets of this file."]
[]
["Password:","zNWQmTZg"]
[]
["Click button below to reprotect all sheets of this file."]
[]
{"$rows_left_out":28}
{"sheet":"References","index":1,"n_rows":55,"n_cols":27,"rows_kept":55,"cut":false,"hidden":true,"merged":[]}
["For Department Use Only"]
[null,"Y/N Indicator",null,"Line Type",null,"General Line (Page 1)",null,"Variance #","Variance Request (Page 7, Page 11)",null,null,"Filing Type and Checklist (Page 3)",null,null,null,null,null,null,null,null,null,"Formula",null,null,"Model Disclosure"]
[null,"Y/N/na Indicator",null,"(Page 1)",null,null,null,null,null,null,null,null,null,null,null,null,null,null,null,null,null,"Change",null,null,"Number of Pages",null,"<- Also used as reference for page 9.Forms on the Category drop down"]
[null,"(Multiple Pages)",null,null,null,null,null,null,null,null,null,"1 indicates item is required, 0 indicates it is not. Blue indicates input.",null,"All","Rate Or Rate Impact","Form","Rule","New Program","Transferred Program",null,null,"Selected Filing Type","Rows to hide",null,1]
["Combo Box controls listed to the right on this row, if applicable =>",null,null,3,null,1,null,null,null,null,null,"Indicator",null,{"$f":"IF('3.Filing Type and Checklist'!A18=\"\",1,0)","v":0},{"$f":"IF(OR('3.Filing Type and Checklist'!$E$8=\"Y\",'3.Filing Type and Checklist'!$E$10=\"Y\",'3.Filing Type and Checklist'!$E$12=\"Y\"),1,0)","v":0},{"$f":"IF('3.Filing Type and Checklist'!$E$11=\"Y\",1,0)","v":0},{"$f":"IF('3.Filing Type and Checklist'!$E$9=\"Y\",1,0)","v":0},{"$f":"IF('3.Filing Type and Checklist'!$E$6=\"Y\",1,0)","v":0},{"$f":"IF('3.Filing Type and Checklist'!$E$7=\"Y\",1,0)","v":0},null,null,null,{"$f":"LEFT(W8&W9&W10&W11&W12&W13&W14&W15&W16&W17&W18&W19&W20&W21&W22&W24&W25&W26&W27&W28&W29&W30&W31&W32&W33&W34&W35&W36&W37&W38&W39&W40&W41&W42&W43&W44&W45&W46&W47&W49&W50&W51&W52&W53&W54&W55,LEN(W8&W9&W10&W11&W12&W13&W14&W15&W16&W17&W18&W19&W20&W21&W22&W24&W25&W26&W27&W28&W29&W30&W31&W32&W33&W34&W35&W36&W37&W38&W39&W40&W41&W42&W43&W44&W45&W46&W47&W48&W50&W51&W52&W53&W54&W55)-1)","v":"A20,A21,A22,A23,A24,A25,A26,A27,A28,A29,A30,A31,A32,A33,A34,A36,A37,A38,A39,A40,A41,A42,A43,A44,A45,A46,A47,A48,A49,A50,A51,A52,A53,A54,A55,A56,A57,A58,A59,A61,A62,A63,A64,A65,A66,A67"},null,{"$f":"Y4-1","v":0}]
[null,"Y",null,"Commercial",null,null,null,"1A","CCR §2644.27(f)(1)(A): Relief from the efficiency standard for bona fide loss-prevention and loss reduction activities (Allocated cost for SIU.)",null,null,"Checklist Item",null,null,null,null,null,null,null,null,null,null,null,null,0]
[null,"N",null,"Personal",null,"Aircraft",null,"1B","CCR §2644.27(f)(1)(B): Relief from the efficiency standard for bona fide loss-prevention and loss reduction activities (Expense for loss prevention programs.)",null,null,"Prior Approval Rate Application","Row Ref on Page 3",null,null,null,null,null,null,"PDF","Excel",null,null,null,1]
[null,"n/a",null,null,null,"Allied Lines",null,"2A","CCR §2644.27(f)(2)(A): Relief from the efficiency standard due to higher quality of service, as demonstrated by objective measures of consumer satisfaction.",null,null,"General Information, Page 1",20,1,null,null,null,"",null,1,1,{"$f":"SUMPRODUCT(N$5:S$5,N8:S8)","v":0},{"$f":"IF(V8=0,\"A\"&$M8&\",\",\"\")","v":"A20,"},null,2]
{"$rows_left_out":48}
{"sheet":"Instructions","index":2,"n_rows":11,"n_cols":2,"rows_kept":11,"cut":false,"hidden":false,"merged":[]}
[null,"Instructions for Completing the Prior Approval Rate Application"]
[]
[null,"Note:  For information on populating the application in its entirety, including the Prior Approval Rate Application, Prior Approval Rate Template and Standard Exhibits Template, refer to the complete Prior Approval Rate Filing Instructions posted in PDF format on the CDI website, below:"]
[null,"http://www.insurance.ca.gov/0250-insurers/0800-rate-filings/"]
[]
["1)","Enter general filing characteristics associated with this application as well as company-specific information on the \"1.General\" page.  Areas of insurer input are generally identified with blue font text and/or light blue outlined boxes.  If this filing contains group data, select the appropriate indicator on the \"1.General\" page. The \"2.Group\" page will automatically unhide to allow for the identification of each company to which this filing applies."]
["2)","Enter the type of filing to which this application applies.  Complete all exhibits and Prior Approval Rate Application pages required for the designated type of filing on the \"3.Filing Type and Checklist\" page, in addition to the Prior Approval Rate Template and Standard Exhibits Template, where applicable.  Refer to the Prior Approval Filing Instructions for more information."]
["3)","On the \"6.Program Detail\" page, provide premium, loss and DCCE information for the entire line of business as shown in your company's Annual Statement as well as for each separate program that comprises your company's line of business.  Programs with less than $25M in premium each can be combined into one entry.  The total of all programs must reconcile to the total Annual Statement line of business for each year provided.  Click the \"Add 5 Programs\" button if additional programs are required.  If filing to be submitted is a group filing, populate the page with group data."]
{"$rows_left_out":4}
{"sheet":"1.General","index":3,"n_rows":71,"n_cols":14,"rows_kept":71,"cut":false,"hidden":false,"merged":[[44,1,44,4],[50,2,50,4],[68,7,68,9],[68,0,68,1],[31,1,31,4],[33,1,33,4],[45,1,45,4],[56,1,56,4],[56,6,56,9],[42,7,42,8],[39,7,39,8],[68,3,68,5],[52,1,52,9],[54,1,54,9],[58,1,58,9],[60,1,60,9],[13,7,13,8],[15,7,15,8],[17,7,17,8],[19,7,19,8],[21,7,21,8],[40,7,40,8],[21,2,21,3],[36,2,36,3],[23,7,23,8],[25,7,25,8],[27,7,27,8],[31,7,31,8]]}
["State of California",null,null,"Company:",null,null,null,null,{"$f":"Co_Name","v":0},null,null,"Error Messages, if Any, Associated with General Information to the Left"]
["Department of Insurance (CDI)",null,null,"Line:",null,null,null,null,{"$f":"General_Line","v":0},null,null,"(DEPARTMENT USE ONLY)"]
[]
["PRIOR APPROVAL RATE APPLICATION FOR PROPERTY & LIABILITY LINES"]
["GENERAL INFORMATION"]
[]
["Completed by:",null,null,"Date:"]
[]
{"$rows_left_out":64}
{"sheet":"2.Group","index":4,"n_rows":103,"n_cols":6,"rows_kept":103,"cut":false,"hidden":true,"merged":[]}
["State of California",null,"Company:",null,null,{"$f":"Co_Name","v":0}]
["Department of Insurance (CDI)",null,"Line:",null,null,{"$f":"General_Line","v":0}]
[]
["INSURER GROUP INFORMATION"]
[]
[null,null,null,null,null,2]
["Is the data from all companies listed below used in the support of this rate application? "]
["If no, please provide an explanation for the differences in the Filing Memorandum."]
{"$rows_left_out":96}
{"sheet":"3.Filing Type and Checklist","index":5,"n_rows":67,"n_cols":10,"rows_kept":67,"cut":false,"hidden":false,"merged":[]}
["State of California",null,null,"Company:",null,null,{"$f":"Co_Name","v":0},"Error Messages, if Any, Associated with Information to the Left"]
["Department of Insurance (CDI)",null,null,"Line:",null,null,{"$f":"General_Line","v":0}]
[]
["FILING TYPE",null,null,null,null,null,null,{"$f":"IF(COUNTIF(E6:E12,\"\")>=1,\"\",IF(COUNTIF(E6:E12,\"Y\")=0,\"ERROR! You must select yes to at least one filing type.\",\"\"))","v":"ERROR! You must select yes to at least one filing type."}]
["Complete the following questions in order to generate the filing checklist:"]
["1.    Is this a New Program filing?",null,null,null,"N",null,null,{"$f":"IF(E6=\"\",\"← ERROR! Please select a response.\",IF(E6=\"Y\",IF(OR(E7=\"Y\",E8=\"Y\",E9=\"Y\",E10=\"Y\",E11=\"Y\",E12=\"Y\"),\"← ERROR! A New Program Filing cannot be combined with a Rate, Rule, Form, or Transferred Program filing.\",\"\"),\"\"))","v":""}]
["2.    Is this a Transferred Program filing?",null,null,null,"N",null,null,{"$f":"IF(E7=\"\",\"← ERROR! Please select a response.\",IF(E7=\"Y\",IF(OR(E6=\"Y\",E8=\"Y\",E9=\"Y\",E10=\"Y\",E11=\"Y\",E12=\"Y\"),\"← ERROR! A Transferred Program Filing cannot be combined with a Rate, Rule, Form or New Program filing.\",\"\"),\"\"))","v":""}]
["3.    Is this a Rate filing?",null,null,null,"N",null,null,{"$f":"IF(E8=\"\",\"← ERROR! Please select a response.\",\"\")","v":""}]
{"$rows_left_out":60}
{"sheet":"4.Proposed Impact","index":6,"n_rows":36,"n_cols":7,"rows_kept":36,"cut":false,"hidden":false,"merged":[]}
["State of California",null,null,"Company:",null,{"$f":"Co_Name","v":0}]
["Department of Insurance (CDI)",null,null,"Line:",null,{"$f":"General_Line","v":0}]
[]
["IMPACT OF PROPOSED CHANGES"]
[]
[null,"Proposed Overall Rate Change:",null,{"$f":"$D$22","v":{"$error":"#DIV/0!"}}]
[]
[null,"Proposed Earned Premium Per Exposure:",null,null,null,null,{"$f":"IF(ISBLANK(D8),\"←ERROR! Enter the Proposed Earned Premium Per Exposure.\",\"\")","v":"←ERROR! Enter the Proposed Earned Premium Per Exposure."}]
{"$rows_left_out":29}
{"sheet":"5.Reconciliation","index":7,"n_rows":29,"n_cols":7,"rows_kept":29,"cut":false,"hidden":false,"merged":[[23,0,23,5]]}
["State of California",null,"Company:",null,null,{"$f":"Co_Name","v":0}]
["Department of Insurance (CDI)",null,"Line:",null,null,{"$f":"General_Line","v":0}]
[]
["RECONCILIATION OF DIRECT EARNED PREMIUM DATA"]
["Annual Statement Statutory Page 14 Calendar Year Data"]
[]
[null,"Coverage/Form/Program1","Latest CDI Filing #2","2nd Prior Calendar Year","1st Prior Calendar Year","Most Recent Calendar Year"]
[null,null,null,{"$f":"E8-1","v":{"$error":"#VALUE!"}},{"$f":"F8-1","v":{"$error":"#VALUE!"}},"YYYY"]
{"$rows_left_out":22}
{"sheet":"6.Program Detail","index":8,"n_rows":232,"n_cols":10,"rows_kept":232,"cut":false,"hidden":false,"merged":[[198,1,198,2],[205,1,205,2],[212,1,212,2],[219,1,219,2],[226,1,226,2],[163,1,163,2],[170,1,170,2],[177,1,177,2],[184,1,184,2],[191,1,191,2],[128,1,128,2],[135,1,135,2],[142,1,142,2],[149,1,149,2],[156,1,156,2],[93,1,93,2],[100,1,100,2],[107,1,107,2],[114,1,114,2],[121,1,121,2],[51,1,51,2],[23,1,23,2],[30,1,30,2],[37,1,37,2],[44,1,44,2],[58,1,58,2],[65,1,65,2],[72,1,72,2],[79,1,79,2],[86,1,86,2]]}
["State of California",null,null,null,null,null,"Company:",null,null,{"$f":"Co_Name","v":0}]
["Department of Insurance (CDI)",null,null,null,null,null,"Line:",null,null,{"$f":"General_Line","v":0}]
[]
[null,{"$f":"CONCATENATE(\"ANNUAL STATEMENT LINE - \", J2,)","v":"ANNUAL STATEMENT LINE - 0"}]
[null,"Year","Written Premium","Earned Premium","Incurred Loss","IL%","DCCE","DCCE%","IL+DCCE","IL+DCCE %"]
["(1)","YYYY",0,0,0,{"$f":"E6/$D6","v":{"$error":"#DIV/0!"}},0,{"$f":"G6/$D6","v":{"$error":"#DIV/0!"}},{"$f":"E6+G6","v":0},{"$f":"I6/$D6","v":{"$error":"#DIV/0!"}}]
["(2)",{"$f":"B6-1","v":{"$error":"#VALUE!"}},0,0,0,{"$f":"E7/$D7","v":{"$error":"#DIV/0!"}},0,{"$f":"G7/$D7","v":{"$error":"#DIV/0!"}},{"$f":"E7+G7","v":0},{"$f":"I7/$D7","v":{"$error":"#DIV/0!"}}]
["(3)",{"$f":"B7-1","v":{"$error":"#VALUE!"}},0,0,0,{"$f":"E8/$D8","v":{"$error":"#DIV/0!"}},0,{"$f":"G8/$D8","v":{"$error":"#DIV/0!"}},{"$f":"E8+G8","v":0},{"$f":"I8/$D8","v":{"$error":"#DIV/0!"}}]
{"$rows_left_out":225}
{"sheet":"7.Statutory Data","index":9,"n_rows":31,"n_cols":5,"rows_kept":31,"cut":false,"hidden":false,"merged":[]}
["State of California",null,"Company:",null,{"$f":"Co_Name","v":0}]
["Department of Insurance (CDI)",null,"Line:",null,{"$f":"General_Line","v":0}]
[]
["ADDITIONAL CALENDAR YEAR DATA REQUIRED BY STATUTE"]
[]
["Refer to CIC §1857.7, CIC §1857.9 and CIC §1864 for more information."]
[]
["Line","Type of Data",null,null,"Most Recent Calendar Year"]
{"$rows_left_out":24}
{"sheet":"8.Miscellaneous Fees","index":10,"n_rows":39,"n_cols":9,"rows_kept":39,"cut":false,"hidden":false,"merged":[]}
["State of California",null,"Company:",null,null,{"$f":"Co_Name","v":0},"Error Messages, if Any, Associated with Miscellaneous Fee Data Input Page to the Left"]
["Department of Insurance (CDI)",null,"Line:",null,null,{"$f":"General_Line","v":0},"(DEPARTMENT USE ONLY)"]
[]
["MISCELLANEOUS FEES AND OTHER CHARGES"]
[]
["Check all fees that apply and identify the current amount charged for each transaction."]
["If no fees apply to this program, check here:",null,null,null,null,null,{"$f":"IF(AND(No_Fees=TRUE,OR(COUNTA(D12:D25)<>0,COUNTA(F12:F25)<>0,COUNTA(D29:D37)<>0,COUNTA(F29:F37)<>0)),\"← ERROR! Remove fees if they do not apply or select the check box indicating that\",\nIF(AND(COUNTA(D12:D25)=0,COUNTA(F12:F25)=0,COUNTA(D29:D37)=0,COUNTA(F29:F37)=0,No_Fees=FALSE),\"← Enter Fees if they apply or select the check box indicating that no fees apply.\",\"\"))","v":"← Enter Fees if they apply or select the check box indicating that no fees apply."}]
["If changes to fees are being proposed in this application, check here:",null,null,null,null,null,{"$f":"IF(AND(No_Fees=TRUE,OR(COUNTA(D12:D25)<>0,COUNTA(F12:F25)<>0,COUNTA(D29:D37)<>0,COUNTA(F29:F37)<>0)),\"no fees apply.\",\"\")","v":""}]
{"$rows_left_out":32}
{"sheet":"9.Forms","index":11,"n_rows":67,"n_cols":13,"rows_kept":67,"cut":false,"hidden":false,"merged":[[48,1,48,2],[49,1,49,2],[50,1,50,2],[51,1,51,2],[48,3,48,11],[49,3,49,11],[50,3,50,11],[51,3,51,11],[44,3,44,11],[45,3,45,11],[41,1,41,2],[42,1,42,2],[43,1,43,2],[44,1,44,2],[45,1,45,2],[41,3,41,11],[42,3,42,11],[43,3,43,11],[67,1,75,11],[52,3,52,11],[52,1,52,2],[55,1,55,2],[56,1,56,2],[57,1,57,2],[58,1,58,2],[59,3,59,11],[59,1,59,2],[58,3,58,11],[57,3,57,11],[56,3,56,11],[55,3,55,11],[20,3,20,11],[21,3,21,11],[36,1,36,2],[29,3,29,11],[30,3,30,11],[31,3,31,11],[22,1,22,2],[23,1,23,2],[24,1,24,2],[22,3,22,11],[23,3,23,11],[24,3,24,11],[27,1,27,2],[28,1,28,2],[28,3,28,11],[27,3,27,11],[34,3,34,11],[35,3,35,11],[36,3,36,11],[38,1,38,2],[37,1,37,2],[34,1,34,2],[35,1,35,2],[37,3,37,11],[38,3,38,11],[29,1,29,2],[30,1,30,2],[31,1,31,2],[20,1,20,2],[21,1,21,2]]}
["State of California",null,null,null,null,null,null,null,null,"Company:",null,{"$f":"Co_Name","v":0}]
["Department of Insurance (CDI)",null,null,null,null,null,null,null,null,"Line:",null,{"$f":"General_Line","v":0}]
[]
["FORMS"]
[]
[]
[null,"Legend of Response Codes"]
[null,"Type Code",null,"Source Code","Category Code"]
{"$rows_left_out":60}
{"sheet":"10.Rules","index":12,"n_rows":40,"n_cols":6,"rows_kept":40,"cut":false,"hidden":false,"merged":[]}
["State of California",null,"Company:",{"$f":"Co_Name","v":0}]
["Department of Insurance (CDI)",null,"Line:",{"$f":"General_Line","v":0}]
[]
["RATING RULES AND UNDERWRITING GUIDELINES"]
[]
["Insurers submitting a rule change filing must provide the information identified below."]
["Complete Exhibit 18 as necessary to fulfill this requirement."]
[]
{"$rows_left_out":33}
{"sheet":"11.Variance Request","index":13,"n_rows":47,"n_cols":8,"rows_kept":47,"cut":false,"hidden":true,"merged":[[17,0,18,6],[20,0,21,6],[23,0,24,6],[26,0,27,6],[29,0,30,6],[32,0,33,6],[35,0,36,6],[38,0,39,6],[41,0,42,6],[44,0,45,6]]}
["State of California",null,null,null,"Company:",null,{"$f":"Co_Name","v":0}]
["Department of Insurance (CDI)",null,null,null,"Line:",null,{"$f":"General_Line","v":0}]
[]
["VARIANCE REQUEST"]
[]
["Select the basis for each variance requested and enter the minimum and maximum permitted rate change percentages resulting"]
["from that variance."]
[]
{"$rows_left_out":40}
{"sheet":"12.1Model Disclosure","index":14,"n_rows":48,"n_cols":16,"rows_kept":48,"cut":false,"hidden":true,"merged":[[43,12,43,14],[5,4,5,9],[12,8,12,10],[16,13,16,14],[17,3,17,4],[24,13,24,14],[28,13,28,14],[33,8,33,9],[37,7,37,9],[38,2,38,4],[39,12,39,13],[40,12,40,13]]}
["State of California",null,null,null,null,null,null,null,null,"Company:",null,null,null,null,null,{"$f":"Co_Name","v":0}]
["Department of Insurance (CDI)",null,null,null,null,null,null,null,null,"Line:",null,null,null,null,null,{"$f":"General_Line","v":0}]
[]
["MODEL DISCLOSURE"]
["This page should contain information exclusive to one specific model."]
["Model Name/Model Version:"]
[]
["Catastrophe Model or Non-Catastrophe Model:"]
{"$rows_left_out":41}
{"sheet":"12.2Model Disclosure","index":15,"n_rows":48,"n_cols":16,"rows_kept":48,"cut":false,"hidden":true,"merged":[[43,12,43,14],[5,4,5,9],[12,8,12,10],[16,13,16,14],[17,3,17,4],[24,13,24,14],[28,13,28,14],[33,8,33,9],[37,7,37,9],[38,2,38,4],[39,12,39,13],[40,12,40,13]]}
["State of California",null,null,null,null,null,null,null,null,"Company:",null,null,null,null,null,{"$f":"Co_Name","v":0}]
["Department of Insurance (CDI)",null,null,null,null,null,null,null,null,"Line:",null,null,null,null,null,{"$f":"General_Line","v":0}]
[]
["MODEL DISCLOSURE"]
["This page should contain information exclusive to one specific model."]
["Model Name/Model Version:"]
[]
["Catastrophe Model or Non-Catastrophe Model:"]
{"$rows_left_out":41}
{"sheet":"12.3Model Disclosure","index":16,"n_rows":48,"n_cols":16,"rows_kept":48,"cut":false,"hidden":true,"merged":[[43,12,43,14],[5,4,5,9],[12,8,12,10],[16,13,16,14],[17,3,17,4],[24,13,24,14],[28,13,28,14],[33,8,33,9],[37,7,37,9],[38,2,38,4],[39,12,39,13],[40,12,40,13]]}
["State of California",null,null,null,null,null,null,null,null,"Company:",null,null,null,null,null,{"$f":"Co_Name","v":0}]
["Department of Insurance (CDI)",null,null,null,null,null,null,null,null,"Line:",null,null,null,null,null,{"$f":"General_Line","v":0}]
[]
["MODEL DISCLOSURE"]
["This page should contain information exclusive to one specific model."]
["Model Name/Model Version:"]
[]
["Catastrophe Model or Non-Catastrophe Model:"]
{"$rows_left_out":41}
{"sheet":"12.4Model Disclosure","index":17,"n_rows":48,"n_cols":16,"rows_kept":48,"cut":false,"hidden":true,"merged":[[43,12,43,14],[5,4,5,9],[12,8,12,10],[16,13,16,14],[17,3,17,4],[24,13,24,14],[28,13,28,14],[33,8,33,9],[37,7,37,9],[38,2,38,4],[39,12,39,13],[40,12,40,13]]}
["State of California",null,null,null,null,null,null,null,null,"Company:",null,null,null,null,null,{"$f":"Co_Name","v":0}]
["Department of Insurance (CDI)",null,null,null,null,null,null,null,null,"Line:",null,null,null,null,null,{"$f":"General_Line","v":0}]
[]
["MODEL DISCLOSURE"]
["This page should contain information exclusive to one specific model."]
["Model Name/Model Version:"]
[]
["Catastrophe Model or Non-Catastrophe Model:"]
{"$rows_left_out":41}
{"sheet":"12.5Model Disclosure","index":18,"n_rows":48,"n_cols":16,"rows_kept":48,"cut":false,"hidden":true,"merged":[[43,12,43,14],[5,4,5,9],[12,8,12,10],[16,13,16,14],[17,3,17,4],[24,13,24,14],[28,13,28,14],[33,8,33,9],[37,7,37,9],[38,2,38,4],[39,12,39,13],[40,12,40,13]]}
["State of California",null,null,null,null,null,null,null,null,"Company:",null,null,null,null,null,{"$f":"Co_Name","v":0}]
["Department of Insurance (CDI)",null,null,null,null,null,null,null,null,"Line:",null,null,null,null,null,{"$f":"General_Line","v":0}]
[]
["MODEL DISCLOSURE"]
["This page should contain information exclusive to one specific model."]
["Model Name/Model Version:"]
[]
["Catastrophe Model or Non-Catastrophe Model:"]
{"$rows_left_out":41}
{"sheet":"12.6Model Disclosure","index":19,"n_rows":48,"n_cols":16,"rows_kept":48,"cut":false,"hidden":true,"merged":[[43,12,43,14],[5,4,5,9],[12,8,12,10],[16,13,16,14],[17,3,17,4],[24,13,24,14],[28,13,28,14],[33,8,33,9],[37,7,37,9],[38,2,38,4],[39,12,39,13],[40,12,40,13]]}
["State of California",null,null,null,null,null,null,null,null,"Company:",null,null,null,null,null,{"$f":"Co_Name","v":0}]
["Department of Insurance (CDI)",null,null,null,null,null,null,null,null,"Line:",null,null,null,null,null,{"$f":"General_Line","v":0}]
[]
["MODEL DISCLOSURE"]
["This page should contain information exclusive to one specific model."]
["Model Name/Model Version:"]
[]
["Catastrophe Model or Non-Catastrophe Model:"]
{"$rows_left_out":41}
{"sheet":"12.7Model Disclosure","index":20,"n_rows":48,"n_cols":16,"rows_kept":48,"cut":false,"hidden":true,"merged":[[43,12,43,14],[5,4,5,9],[12,8,12,10],[16,13,16,14],[17,3,17,4],[24,13,24,14],[28,13,28,14],[33,8,33,9],[37,7,37,9],[38,2,38,4],[39,12,39,13],[40,12,40,13]]}
["State of California",null,null,null,null,null,null,null,null,"Company:",null,null,null,null,null,{"$f":"Co_Name","v":0}]
["Department of Insurance (CDI)",null,null,null,null,null,null,null,null,"Line:",null,null,null,null,null,{"$f":"General_Line","v":0}]
[]
["MODEL DISCLOSURE"]
["This page should contain information exclusive to one specific model."]
["Model Name/Model Version:"]
[]
["Catastrophe Model or Non-Catastrophe Model:"]
{"$rows_left_out":41}
{"sheet":"12.8Model Disclosure","index":21,"n_rows":48,"n_cols":16,"rows_kept":48,"cut":false,"hidden":true,"merged":[[43,12,43,14],[5,4,5,9],[12,8,12,10],[16,13,16,14],[17,3,17,4],[24,13,24,14],[28,13,28,14],[33,8,33,9],[37,7,37,9],[38,2,38,4],[39,12,39,13],[40,12,40,13]]}
["State of California",null,null,null,null,null,null,null,null,"Company:",null,null,null,null,null,{"$f":"Co_Name","v":0}]
["Department of Insurance (CDI)",null,null,null,null,null,null,null,null,"Line:",null,null,null,null,null,{"$f":"General_Line","v":0}]
[]
["MODEL DISCLOSURE"]
["This page should contain information exclusive to one specific model."]
["Model Name/Model Version:"]
[]
["Catastrophe Model or Non-Catastrophe Model:"]
{"$rows_left_out":41}
{"sheet":"12.9Model Disclosure","index":22,"n_rows":48,"n_cols":16,"rows_kept":48,"cut":false,"hidden":true,"merged":[[43,12,43,14],[5,4,5,9],[12,8,12,10],[16,13,16,14],[17,3,17,4],[24,13,24,14],[28,13,28,14],[33,8,33,9],[37,7,37,9],[38,2,38,4],[39,12,39,13],[40,12,40,13]]}
["State of California",null,null,null,null,null,null,null,null,"Company:",null,null,null,null,null,{"$f":"Co_Name","v":0}]
["Department of Insurance (CDI)",null,null,null,null,null,null,null,null,"Line:",null,null,null,null,null,{"$f":"General_Line","v":0}]
[]
["MODEL DISCLOSURE"]
["This page should contain information exclusive to one specific model."]
["Model Name/Model Version:"]
[]
["Catastrophe Model or Non-Catastrophe Model:"]
{"$rows_left_out":41}
{"sheet":"12.10Model Disclosure","index":23,"n_rows":48,"n_cols":16,"rows_kept":48,"cut":false,"hidden":true,"merged":[[43,12,43,14],[5,4,5,9],[12,8,12,10],[16,13,16,14],[17,3,17,4],[24,13,24,14],[28,13,28,14],[33,8,33,9],[37,7,37,9],[38,2,38,4],[39,12,39,13],[40,12,40,13]]}
["State of California",null,null,null,null,null,null,null,null,"Company:",null,null,null,null,null,{"$f":"Co_Name","v":0}]
["Department of Insurance (CDI)",null,null,null,null,null,null,null,null,"Line:",null,null,null,null,null,{"$f":"General_Line","v":0}]
[]
["MODEL DISCLOSURE"]
["This page should contain information exclusive to one specific model."]
["Model Name/Model Version:"]
[]
["Catastrophe Model or Non-Catastrophe Model:"]
{"$rows_left_out":40}