{"text_format":"1","workbook":"xlsx","n_sheets":6,"sheets":["Instructions","Input","InputYear2","2024 & 2025 Assessment","CalculationYear2","Keys"],"not_rendered":{"charts":0,"images":0,"macros":1,"external_links":0,"defined_names":6,"comments":0,"pivot_tables":0},"unopened":[],"bounds":{"document_bytes":16777216,"sheet_cells":100000,"rows_first":2000,"rows_last":500,"rows_between":2000,"halvings":0,"cell_chars":16384,"cell_head_chars":4096},"cells_cut":0,"cells_raw":0,"read":"whole","date_system":"1900"}

{"sheet":"Instructions","index":0,"n_rows":25,"n_cols":3,"rows_kept":25,"cut":false,"hidden":false,"merged":[]}
[]
[null,"This template is intended to reconcile the Temporary Supplemental Fee (TSF) Recoupment in year 1. If the company plans to modify the recoupment %, please select \"Yes\" in question D in the \"Input\" Tab"]
[]
[null,"Please provide the following information within the \"Input\" tab:"]
[null,0,"This Template is intended for updating Temporary Supplemental Fee (TSF) Recoupment in year 2 for a 2-year recoupment period. If the company has a one year recoupment period, this template is not applicable."]
[null,1,"The company group name in cell E1. If company is not part of a group, please input the company name."]
[null,2,"All relevant company information above table A."]
[null,3,"Complete table A; the \"Total\" row is calculated automatically."]
[null,4,"Item B, the line of business in cell D25. NOTE: If the company needs to recoup from both personal and commercial lines, the company would need to complete two separate templates. Cell G25 is calculated automatically."]
[null,6,"Complete table D; the \"Total\" row is calculated automatically."]
[null,7,"Table A, \"Total Recoupment Amount\" Column is automatically calculated. "]
[null,8,"If you have a two year recoupment period, and plan to update the recoupment % for year 2, please select \"Two\" in D27, and \"Yes\" in D29"]
[]
[null,"Please provide the following information within the \"InputYear2\" :"]
[null,1,"The two tabs (InputYear2 and CalculationYear2) are intended for updating Temporary Supplemental Fee (TSF) Recoupment in year 2 for a 2-year recoupment period. If the company has a one year recoupment period or the company does not intend to update the recoupment %, this two tabs are not applicable."]
[null,2,"The company group name in cell E1. If company is not part of a group, please input the company name."]
[null,3,"All relevant company information above table A."]
[null,4,"Complete table A; the \"Total\" row is calculated automatically. \"Total Recoupment Amount\" colum is also calculated automatically. "]
[null,5,"Item B, the line of business in cell D25. NOTE: If the company needs to recoup from both personal and commercial lines, the company would need to complete two separate templates. Cell G25 is calculated automatically."]
[null,6,"Complete table E; the \"Total\" row is calculated automatically."]
{"$rows_left_out":6}
{"sheet":"Input","index":1,"n_rows":32,"n_cols":10,"rows_kept":32,"cut":false,"hidden":false,"merged":[]}
["State of California",null,null,"Group:"]
["Department of Insurance (CDI)"]
[]
["FAIR PLAN TEMPORARY SUPPLEMENTAL FEE TEMPLATE (Year 2)"]
["GENERAL INFORMATION"]
[]
["Completed by",null,null,"Date:"]
[]
["Prior TSF Recoup. Company File #:",null,null,"Effective Date:"]
[]
["A. Input in the Total Assessment by Company and by Line"]
["Company Name","Line of Business","NAIC Group #","NAIC #","Assessment Amount ($)","Recoup %","Amount Recouped in Year 1 ($)","Total Recoupment Amount ($)"]
[null,null,null,null,null,null,null,{"$f":"IF(E13*F13=0,\"\",E13*F13)","v":""},{"$f":"IFERROR(IF(B13=\"Commercial\",INDEX('2024 & 2025 Assessment'!$I$3:$I$308,MATCH(Input!D13,'2024 & 2025 Assessment'!$A$3:$A$308,0))+INDEX('2024 & 2025 Assessment'!$K$3:$K$308,MATCH(Input!D13,'2024 & 2025 Assessment'!$A$3:$A$308,0)),INDEX('2024 & 2025 Assessment'!$J$3:$J$308,MATCH(Input!D13,'2024 & 2025 Assessment'!$A$3:$A$308,0))+INDEX('2024 & 2025 Assessment'!$H$3:$H$308,MATCH(Input!D13,'2024 & 2025 Assessment'!$A$3:$A$308,0))),\"\")","v":""},{"$f":"IF(IFERROR(ABS(I13-E13)<1000,TRUE),\"\",\"Assessment Amount does not match\")","v":""}]
[null,null,null,null,null,null,null,"",{"$f":"IFERROR(IF(B14=\"Commercial\",INDEX('2024 & 2025 Assessment'!$I$3:$I$308,MATCH(Input!D14,'2024 & 2025 Assessment'!$A$3:$A$308,0))+INDEX('2024 & 2025 Assessment'!$K$3:$K$308,MATCH(Input!D14,'2024 & 2025 Assessment'!$A$3:$A$308,0)),INDEX('2024 & 2025 Assessment'!$J$3:$J$308,MATCH(Input!D14,'2024 & 2025 Assessment'!$A$3:$A$308,0))+INDEX('2024 & 2025 Assessment'!$H$3:$H$308,MATCH(Input!D14,'2024 & 2025 Assessment'!$A$3:$A$308,0))),\"\")","v":""},{"$f":"IF(IFERROR(ABS(I14-E14)<1000,TRUE),\"\",\"Assessment Amount does not match\")","v":""}]
[null,null,null,null,null,null,null,"",{"$f":"IFERROR(IF(B15=\"Commercial\",INDEX('2024 & 2025 Assessment'!$I$3:$I$308,MATCH(Input!D15,'2024 & 2025 Assessment'!$A$3:$A$308,0))+INDEX('2024 & 2025 Assessment'!$K$3:$K$308,MATCH(Input!D15,'2024 & 2025 Assessment'!$A$3:$A$308,0)),INDEX('2024 & 2025 Assessment'!$J$3:$J$308,MATCH(Input!D15,'2024 & 2025 Assessment'!$A$3:$A$308,0))+INDEX('2024 & 2025 Assessment'!$L$3:$L$308,MATCH(Input!D15,'2024 & 2025 Assessment'!$A$3:$A$308,0))),\"\")","v":""},""]
[null,null,null,null,null,null,null,"",{"$f":"IFERROR(IF(B16=\"Commercial\",INDEX('2024 & 2025 Assessment'!$I$3:$I$308,MATCH(Input!D16,'2024 & 2025 Assessment'!$A$3:$A$308,0))+INDEX('2024 & 2025 Assessment'!$K$3:$K$308,MATCH(Input!D16,'2024 & 2025 Assessment'!$A$3:$A$308,0)),INDEX('2024 & 2025 Assessment'!$J$3:$J$308,MATCH(Input!D16,'2024 & 2025 Assessment'!$A$3:$A$308,0))+INDEX('2024 & 2025 Assessment'!$L$3:$L$308,MATCH(Input!D16,'2024 & 2025 Assessment'!$A$3:$A$308,0))),\"\")","v":""},""]
[null,null,null,null,null,null,null,"",{"$f":"IFERROR(IF(B17=\"Commercial\",INDEX('2024 & 2025 Assessment'!$I$3:$I$308,MATCH(Input!D17,'2024 & 2025 Assessment'!$A$3:$A$308,0))+INDEX('2024 & 2025 Assessment'!$K$3:$K$308,MATCH(Input!D17,'2024 & 2025 Assessment'!$A$3:$A$308,0)),INDEX('2024 & 2025 Assessment'!$J$3:$J$308,MATCH(Input!D17,'2024 & 2025 Assessment'!$A$3:$A$308,0))+INDEX('2024 & 2025 Assessment'!$L$3:$L$308,MATCH(Input!D17,'2024 & 2025 Assessment'!$A$3:$A$308,0))),\"\")","v":""},""]
[null,null,null,null,null,null,null,"",{"$f":"IFERROR(IF(B18=\"Commercial\",INDEX('2024 & 2025 Assessment'!$I$3:$I$308,MATCH(Input!D18,'2024 & 2025 Assessment'!$A$3:$A$308,0))+INDEX('2024 & 2025 Assessment'!$K$3:$K$308,MATCH(Input!D18,'2024 & 2025 Assessment'!$A$3:$A$308,0)),INDEX('2024 & 2025 Assessment'!$J$3:$J$308,MATCH(Input!D18,'2024 & 2025 Assessment'!$A$3:$A$308,0))+INDEX('2024 & 2025 Assessment'!$L$3:$L$308,MATCH(Input!D18,'2024 & 2025 Assessment'!$A$3:$A$308,0))),\"\")","v":""},""]
[null,null,null,null,null,null,null,"",{"$f":"IFERROR(IF(B19=\"Commercial\",INDEX('2024 & 2025 Assessment'!$I$3:$I$308,MATCH(Input!D19,'2024 & 2025 Assessment'!$A$3:$A$308,0))+INDEX('2024 & 2025 Assessment'!$K$3:$K$308,MATCH(Input!D19,'2024 & 2025 Assessment'!$A$3:$A$308,0)),INDEX('2024 & 2025 Assessment'!$J$3:$J$308,MATCH(Input!D19,'2024 & 2025 Assessment'!$A$3:$A$308,0))+INDEX('2024 & 2025 Assessment'!$L$3:$L$308,MATCH(Input!D19,'2024 & 2025 Assessment'!$A$3:$A$308,0))),\"\")","v":""},""]
[null,null,null,null,null,null,null,"",{"$f":"IFERROR(IF(B20=\"Commercial\",INDEX('2024 & 2025 Assessment'!$I$3:$I$308,MATCH(Input!D20,'2024 & 2025 Assessment'!$A$3:$A$308,0))+INDEX('2024 & 2025 Assessment'!$K$3:$K$308,MATCH(Input!D20,'2024 & 2025 Assessment'!$A$3:$A$308,0)),INDEX('2024 & 2025 Assessment'!$J$3:$J$308,MATCH(Input!D20,'2024 & 2025 Assessment'!$A$3:$A$308,0))+INDEX('2024 & 2025 Assessment'!$L$3:$L$308,MATCH(Input!D20,'2024 & 2025 Assessment'!$A$3:$A$308,0))),\"\")","v":""},""]
{"$rows_left_out":13}
{"sheet":"InputYear2","index":2,"n_rows":50,"n_cols":10,"rows_kept":50,"cut":false,"hidden":true,"merged":[]}
["State of California",null,null,"Group:"]
["Department of Insurance (CDI)"]
[]
["FAIR PLAN TEMPORARY SUPPLEMENTAL FEE TEMPLATE (Year 2)"]
["GENERAL INFORMATION"]
[]
["Completed by",null,null,"Date:"]
[]
["Prior TSF Recoup. Company File #:",null,null,"Effective Date:"]
[]
["A. Input in the Total Assessment by Company and by Line"]
["Company Name","Line of Business","NAIC Group #","NAIC #","Assessment Amount ($)","Recoup %","Amount Recouped in Year 1 ($)","Total Recoupment Amount ($)"]
[null,null,null,null,null,null,null,{"$f":"IF(E13*F13=0,\"\",E13*F13)","v":""},{"$f":"IFERROR(IF(B13=\"Commercial\",INDEX('2024 & 2025 Assessment'!$I$3:$I$308,MATCH(InputYear2!D13,'2024 & 2025 Assessment'!$A$3:$A$308,0))+INDEX('2024 & 2025 Assessment'!$K$3:$K$308,MATCH(InputYear2!D13,'2024 & 2025 Assessment'!$A$3:$A$308,0)),INDEX('2024 & 2025 Assessment'!$J$3:$J$308,MATCH(InputYear2!D13,'2024 & 2025 Assessment'!$A$3:$A$308,0))+INDEX('2024 & 2025 Assessment'!$H$3:$H$308,MATCH(InputYear2!D13,'2024 & 2025 Assessment'!$A$3:$A$308,0))),\"\")","v":""},{"$f":"IF(IFERROR(ABS(I13-E13)<1000,TRUE),\"\",\"Assessment does not match\")","v":""}]
[null,null,null,null,null,null,null,"",{"$f":"IFERROR(IF(B14=\"Commercial\",INDEX('2024 & 2025 Assessment'!$I$3:$I$308,MATCH(InputYear2!D14,'2024 & 2025 Assessment'!$A$3:$A$308,0))+INDEX('2024 & 2025 Assessment'!$K$3:$K$308,MATCH(InputYear2!D14,'2024 & 2025 Assessment'!$A$3:$A$308,0)),INDEX('2024 & 2025 Assessment'!$J$3:$J$308,MATCH(InputYear2!D14,'2024 & 2025 Assessment'!$A$3:$A$308,0))+INDEX('2024 & 2025 Assessment'!$H$3:$H$308,MATCH(InputYear2!D14,'2024 & 2025 Assessment'!$A$3:$A$308,0))),\"\")","v":""},""]
[null,null,null,null,null,null,null,"",{"$f":"IFERROR(IF(B15=\"Commercial\",INDEX('2024 & 2025 Assessment'!$I$3:$I$308,MATCH(InputYear2!D15,'2024 & 2025 Assessment'!$A$3:$A$308,0))+INDEX('2024 & 2025 Assessment'!$K$3:$K$308,MATCH(InputYear2!D15,'2024 & 2025 Assessment'!$A$3:$A$308,0)),INDEX('2024 & 2025 Assessment'!$J$3:$J$308,MATCH(InputYear2!D15,'2024 & 2025 Assessment'!$A$3:$A$308,0))+INDEX('2024 & 2025 Assessment'!$L$3:$L$308,MATCH(InputYear2!D15,'2024 & 2025 Assessment'!$A$3:$A$308,0))),\"\")","v":""},""]
[null,null,null,null,null,null,null,"",{"$f":"IFERROR(IF(B16=\"Commercial\",INDEX('2024 & 2025 Assessment'!$I$3:$I$308,MATCH(InputYear2!D16,'2024 & 2025 Assessment'!$A$3:$A$308,0))+INDEX('2024 & 2025 Assessment'!$K$3:$K$308,MATCH(InputYear2!D16,'2024 & 2025 Assessment'!$A$3:$A$308,0)),INDEX('2024 & 2025 Assessment'!$J$3:$J$308,MATCH(InputYear2!D16,'2024 & 2025 Assessment'!$A$3:$A$308,0))+INDEX('2024 & 2025 Assessment'!$L$3:$L$308,MATCH(InputYear2!D16,'2024 & 2025 Assessment'!$A$3:$A$308,0))),\"\")","v":""},""]
[null,null,null,null,null,null,null,"",{"$f":"IFERROR(IF(B17=\"Commercial\",INDEX('2024 & 2025 Assessment'!$I$3:$I$308,MATCH(InputYear2!D17,'2024 & 2025 Assessment'!$A$3:$A$308,0))+INDEX('2024 & 2025 Assessment'!$K$3:$K$308,MATCH(InputYear2!D17,'2024 & 2025 Assessment'!$A$3:$A$308,0)),INDEX('2024 & 2025 Assessment'!$J$3:$J$308,MATCH(InputYear2!D17,'2024 & 2025 Assessment'!$A$3:$A$308,0))+INDEX('2024 & 2025 Assessment'!$L$3:$L$308,MATCH(InputYear2!D17,'2024 & 2025 Assessment'!$A$3:$A$308,0))),\"\")","v":""},""]
[null,null,null,null,null,null,null,"",{"$f":"IFERROR(IF(B18=\"Commercial\",INDEX('2024 & 2025 Assessment'!$I$3:$I$308,MATCH(InputYear2!D18,'2024 & 2025 Assessment'!$A$3:$A$308,0))+INDEX('2024 & 2025 Assessment'!$K$3:$K$308,MATCH(InputYear2!D18,'2024 & 2025 Assessment'!$A$3:$A$308,0)),INDEX('2024 & 2025 Assessment'!$J$3:$J$308,MATCH(InputYear2!D18,'2024 & 2025 Assessment'!$A$3:$A$308,0))+INDEX('2024 & 2025 Assessment'!$L$3:$L$308,MATCH(InputYear2!D18,'2024 & 2025 Assessment'!$A$3:$A$308,0))),\"\")","v":""},""]
[null,null,null,null,null,null,null,"",{"$f":"IFERROR(IF(B19=\"Commercial\",INDEX('2024 & 2025 Assessment'!$I$3:$I$308,MATCH(InputYear2!D19,'2024 & 2025 Assessment'!$A$3:$A$308,0))+INDEX('2024 & 2025 Assessment'!$K$3:$K$308,MATCH(InputYear2!D19,'2024 & 2025 Assessment'!$A$3:$A$308,0)),INDEX('2024 & 2025 Assessment'!$J$3:$J$308,MATCH(InputYear2!D19,'2024 & 2025 Assessment'!$A$3:$A$308,0))+INDEX('2024 & 2025 Assessment'!$L$3:$L$308,MATCH(InputYear2!D19,'2024 & 2025 Assessment'!$A$3:$A$308,0))),\"\")","v":""},""]
[null,null,null,null,null,null,null,"",{"$f":"IFERROR(IF(B20=\"Commercial\",INDEX('2024 & 2025 Assessment'!$I$3:$I$308,MATCH(InputYear2!D20,'2024 & 2025 Assessment'!$A$3:$A$308,0))+INDEX('2024 & 2025 Assessment'!$K$3:$K$308,MATCH(InputYear2!D20,'2024 & 2025 Assessment'!$A$3:$A$308,0)),INDEX('2024 & 2025 Assessment'!$J$3:$J$308,MATCH(InputYear2!D20,'2024 & 2025 Assessment'!$A$3:$A$308,0))+INDEX('2024 & 2025 Assessment'!$L$3:$L$308,MATCH(InputYear2!D20,'2024 & 2025 Assessment'!$A$3:$A$308,0))),\"\")","v":""},""]
{"$rows_left_out":31}
{"sheet":"2024 & 2025 Assessment","index":3,"n_rows":324,"n_cols":13,"rows_kept":324,"cut":false,"hidden":true,"merged":[]}
[null,null,null,null,null,null,null,642400000,15700000,331400000,10500000,{"$f":"SUM(H1:K1)","v":1000000000}]
["NAIC #","NAIC Group #","Company Name","2024 FINAL PARTICIPATION RATE (DWELLING)","2024 FINAL PARTICIPATION RATE (COMMERCIAL)","2025 FINAL PARTICIPATION RATE DWELLING","2025 FINAL PARTICIPATION RATE - COMMERCIAL","2024 DWELLING ASSESSMENT","2024 COMMERCIAL ASSESSMENT","2025 DWELLING ASSESSMENT","2025 COMMERCIAL ASSESSMENT","Total Assessment"]
[10048,0,"Hyundai Marine & Fire Ins Co Ltd",5.0399999999999999E-5,0,7.75E-5,0,{"$f":"ROUND(D3*H$1,0)","v":32377},{"$f":"ROUND(E3*I$1,0)","v":0},{"$f":"ROUND(F3*J$1,0)","v":25684},{"$f":"ROUND(G3*K$1,0)","v":0},{"$f":"SUM(H3:K3)","v":58061}]
[10683,0,"Wawanesa Gen Ins Co",3.1495E-3,0,3.3673000000000002E-3,0,2023239,0,1115923,0,3139162]
[10830,0,"Business Alliance Ins Co",0,8.9459999999999995E-4,0,1.1728999999999999E-3,0,14045,0,12315,26360]
[11118,0,"Federated Rural Electric Ins Exch",6.8000000000000001E-6,0,1.38E-5,0,4368,0,4573,0,8941]
[11231,0,"Generali Us Branch",0,2.9999999999999999E-7,0,0,0,5,0,0,5]
[13528,0,"Brotherhood Mut Ins Co",0,5.8703999999999996E-3,0,6.3116999999999999E-3,0,92165,0,66273,158438]
[27480,0,"California Mut Ins Co",7.4499999999999995E-5,2.2491E-3,1.013E-4,3.1665E-3,47859,35311,33571,33248,149989]
[32107,0,"Sutter Ins Co",9.9999999999999995E-8,0,0,0,64,0,0,0,64]
[33499,0,"Dorinco Reins Co",2.6999999999999999E-5,0,2.7100000000000001E-5,0,17345,0,8981,0,26326]
[37800,0,"Kookmin Best Ins Co Ltd",0,1.1903E-3,0,0,0,18688,0,0,18688]
[38300,0,"Samsung Fire & Marine Ins Co Ltd",0,9.9000000000000001E-6,0,5.9000000000000003E-6,0,155,0,62,217]
[39861,0,"Golden Bear Ins Co",8.2160000000000002E-4,3.2523999999999999E-3,4.7800000000000002E-4,0,527796,51063,158409,0,737268]
[40975,0,"Dentists Ins Co",0,4.9781000000000001E-3,0,5.4364000000000001E-3,0,78156,0,57082,135238]
[41459,0,"Armed Forces Ins Exch",2.496E-4,0,2.2020000000000001E-4,0,160343,0,72974,0,233317]
[13935,7,"Federated Mut Ins Co",1.2022000000000001E-3,1.2486000000000001E-3,1.4128999999999999E-3,1.7124E-3,772293,19603,468235,17980,1278111]
[28304,7,"Federated Serv Ins Co",1.7000000000000001E-4,0,1.9799999999999999E-4,0,109208,0,65617,0,174825]
[10358,8,"Encompass Ins Co",2.7271999999999999E-3,0,3.1307000000000001E-3,0,1751953,0,1037514,0,2789467]
[16217,8,"National Farmers Union Prop & Cas",0,1.496E-4,0,1.95E-5,0,2349,0,205,2554]
{"$rows_left_out":305}
{"sheet":"CalculationYear2","index":4,"n_rows":46,"n_cols":9,"rows_kept":46,"cut":false,"hidden":true,"merged":[]}
["State of California",null,null,"Group",null,null,null,null,{"$f":"InputYear2!$G$1","v":0}]
["Department of Insurance (CDI)",null,null,"Line:",null,null,null,null,{"$f":"InputYear2!D25","v":0}]
[]
["FAIR PLAN RECOUPMENT ASSESSMENT TEMPLATE (Year 2)"]
["GENERAL INFORMATION"]
[]
["Total Recoupment Amount",{"$f":"InputYear2!H25","v":0}]
["Recouped Amount in Year 1",{"$f":"InputYear2!G25","v":0}]
["Remaining Recoupment Amount",{"$f":"B7-B8","v":0}]
["Total Written Premium Next Renewal Cycle",{"$f":"InputYear2!C44","v":""}]
["Annual Recoupment as a % of Total WP Next Renewal Cycle",{"$f":"IFERROR(IF(B10=0,\"\",B9/B10),\"\")","v":""}]
["Selected Recoupment as a % of Total WP",{"$f":"B11","v":""}]
[]
[{"$f":"\"Calculation of Recoupment Assessment as a Percent of Written Premium Based on \"&InputYear2!D27&\" Collection Period\"","v":"Calculation of Recoupment Assessment as a Percent of Written Premium Based on Two Collection Period"}]
["Line of Business","Total premium","Average Premium","Average Recoupment","Percent Annual Assessment","LOB"]
[{"$f":"IF(ISBLANK(InputYear2!A34),\"\",InputYear2!A34)","v":""},{"$f":"IF(ISBLANK(InputYear2!C34),\"\",InputYear2!C34)","v":""},{"$f":"IFERROR(InputYear2!C34/InputYear2!D34,\"\")","v":""},{"$f":"IFERROR(C16*$B$12,\"\")","v":""},{"$f":"IFERROR(D16/C16,\"\")","v":""},{"$f":"IFERROR(INDEX(Keys!$C$2:$C$23,MATCH(CalculationYear2!A16,Keys!$B$2:$B$24,0)),\"\")","v":""}]
[{"$f":"IF(ISBLANK(InputYear2!A35),\"\",InputYear2!A35)","v":""},{"$f":"IF(ISBLANK(InputYear2!C35),\"\",InputYear2!C35)","v":""},{"$f":"IFERROR(InputYear2!C35/InputYear2!D35,\"\")","v":""},{"$f":"IFERROR(C17*$B$12,\"\")","v":""},{"$f":"IFERROR(D17/C17,\"\")","v":""},{"$f":"IFERROR(INDEX(Keys!$C$2:$C$23,MATCH(CalculationYear2!A17,Keys!$B$2:$B$24,0)),\"\")","v":""}]
[{"$f":"IF(ISBLANK(InputYear2!A36),\"\",InputYear2!A36)","v":""},{"$f":"IF(ISBLANK(InputYear2!C36),\"\",InputYear2!C36)","v":""},{"$f":"IFERROR(InputYear2!C36/InputYear2!D36,\"\")","v":""},{"$f":"IFERROR(C18*$B$12,\"\")","v":""},"",{"$f":"IFERROR(INDEX(Keys!$C$2:$C$23,MATCH(CalculationYear2!A18,Keys!$B$2:$B$24,0)),\"\")","v":""}]
[{"$f":"IF(ISBLANK(InputYear2!A37),\"\",InputYear2!A37)","v":""},{"$f":"IF(ISBLANK(InputYear2!C37),\"\",InputYear2!C37)","v":""},{"$f":"IFERROR(InputYear2!C37/InputYear2!D37,\"\")","v":""},{"$f":"IFERROR(C19*$B$12,\"\")","v":""},"",{"$f":"IFERROR(INDEX(Keys!$C$2:$C$23,MATCH(CalculationYear2!A19,Keys!$B$2:$B$24,0)),\"\")","v":""}]
[{"$f":"IF(ISBLANK(InputYear2!A38),\"\",InputYear2!A38)","v":""},{"$f":"IF(ISBLANK(InputYear2!C38),\"\",InputYear2!C38)","v":""},{"$f":"IFERROR(InputYear2!C38/InputYear2!D38,\"\")","v":""},"","",{"$f":"IFERROR(INDEX(Keys!$C$2:$C$23,MATCH(CalculationYear2!A20,Keys!$B$2:$B$24,0)),\"\")","v":""}]
{"$rows_left_out":27}
{"sheet":"Keys","index":5,"n_rows":31,"n_cols":12,"rows_kept":31,"cut":false,"hidden":true,"merged":[]}
["POLICY_TYPE","Key",null,null,null,"Personal","Commercial",null,null,null,null,"Personal"]
["DO         ","Dwelling Owner-Occupied (Non-Seasonal)","Fire and Allied",null,null,"Dwelling Owner-Occupied (Non-Seasonal)","Farmowners",null,null,null,null,"Commercial"]
["DS         ","Dwelling Owner-Occupied (Seasonal)","Fire and Allied",null,null,"Dwelling Owner-Occupied (Seasonal)","Commercial Multi-Peril - Property Line"]
["DT         ","Dwelling Tenant-Occupied","Fire and Allied",null,null,"Dwelling Tenant-Occupied","Commercial Multi-Peril - Liability Line"]
["DC         ","Dwelling Contents-Only","Fire and Allied",null,null,"Dwelling Contents-Only","Commercial Fire and Allied"]
["FP         ","Force-Placed Occupied","Other",null,null,"Force-Placed Occupied","Other Coverage"]
["FX         ","Force-Placed Vacant","Other",null,null,"Force-Placed Vacant"]
["XX         ","Vacant","Other",null,null,"Vacant"]
[1,"HO-1","Homeowner",null,null,"HO-1"]
[2,"HO-2","Homeowner",null,null,"HO-2"]
[3,"HO-3","Homeowner",null,null,"HO-3"]
[4,"HO-4","Homeowner",null,null,"HO-4"]
[5,"HO-5","Homeowner",null,null,"HO-5"]
[6,"HO-6","Homeowner",null,null,"HO-6"]
["R6         ","HO-6 (Tenant-Occupied)","Homeowner",null,null,"HO-6 (Tenant-Occupied)"]
[7,"HO-7","Homeowner",null,null,"HO-7"]
["R7         ","HO-7 (Tenant-Occupied)","Homeowner",null,null,"HO-7 (Tenant-Occupied)"]
[8,"HO-8","Homeowner",null,null,"HO-8"]
[null,"Farmowners","Farmowners",null,null,"Other Fire and Allied"]
[null,"Commercial Multi-Peril - Property Line","CMP - Property",null,null,"Other Coverage"]
{"$rows_left_out":11}