{"text_format":"1","workbook":"xlsx","n_sheets":10,"sheets":["Cover Page","Pt 1 Summary of Data","Pt 2 Premium and Claims","Pt 3 Expense Allocation","Pt 4 MLR Calculation","Pt 5 Additional Responses","Attestation","Dec 2023","March 2023","March 2024"],"not_rendered":{"charts":0,"images":0,"macros":1,"external_links":35,"defined_names":543,"comments":0,"pivot_tables":0},"unopened":[],"bounds":{"document_bytes":16777216,"sheet_cells":100000,"rows_first":2000,"rows_last":500,"rows_between":2000,"halvings":0,"cell_chars":16384,"cell_head_chars":4096},"cells_cut":0,"cells_raw":0,"read":"whole","date_system":"1900"}

{"sheet":"Cover Page","index":0,"n_rows":22,"n_cols":3,"rows_kept":22,"cut":false,"hidden":false,"merged":[]}
[null,"Department of Managed Health Care/Department of Insurance"]
[null,"Medical Loss Ratio Reporting Form "]
[null,"Dental Coverage"]
[]
[]
["1.","MLR Reporting Year","2023"]
["2.","Enter DMHC Health Plan ID. Insurers may leave this field blank"]
["3.","Legal Name","Dearborn Life Insurance Company"]
["4.","DBA","Health Insurer"]
["5.","Federal Tax Exempt Status? Please enter Yes or No","No"]
[]
[]
[]
[null,"Cell Key:"]
[null,"Blank cells require input from Health plan or Health insurer"]
[]
[]
[null,"Version 4.22.15"]
[null,"Revised Version 5.26.15"]
[null,"Revised Version 4.15.16 corrected dates for Cycle Year (CY)2015-2016 on TABs Parts 1, 2 and 4."]
[null,"Revised Version 5.10.17 12/31 and 3/31 Columns years to be auto populated on TABs Parts 1 and 2."]
[null,"Revised Version 5.20.19 Document Accessible"]

{"sheet":"Pt 1 Summary of Data","index":1,"n_rows":58,"n_cols":16,"rows_kept":58,"cut":false,"hidden":false,"merged":[]}
[null,"Department of Managed Health Care/Department of Insurance"]
[null,"Medical Loss Ratio Reporting Form: Dental Coverage"]
[null,"Part 1 - Summary of Data"]
[]
[null,"Health Plan ID",null,null,null,null,null,"Federal Tax Exempt "]
[null,null,null,{"$f":"'Cover Page'!C7","v":0},null,null,null,{"$f":"'Cover Page'!C10","v":"No"}]
[null,"Legal Name"]
[null,null,null,{"$f":"'Cover Page'!C8","v":"Dearborn Life Insurance Company"}]
[null,"dBA",null,null,"Part 1"]
[null,null,null,{"$f":"'Cover Page'!C9","v":"Health Insurer"}]
[null,"MLR Reporting Year"]
[null,null,null,{"$f":"'Cover Page'!C6","v":"2023"}]
[]
[null,null,null,null,null,null,"Health Insurance Coverage",null,null,null,null,null,"Health Insurance Coverage"]
[null,null,null,null,null,null,"DHMO Products",null,null,null,null,null,"DPPO & Indemnity Products"]
[null,null,null,null,"Individual",null,"Small Group",null,"Large Group",null,"Individual",null,"Small Group",null,"Large Group"]
[null,null,null,null,"Total as of ","Total as of ","Total as of ","Total as of ","Total as of ","Total as of ","Total as of ","Total as of ","Total as of ","Total as of ","Total as of ","Total as of "]
[null,null,null,"Part 1\nNOTE: REFER TO MLR INSTRUCTIONS FOR IMPORTANT ",{"$f":"\"12/31/\"&\"\"&'Cover Page'!C$6","v":"12/31/2023"},{"$f":"DATE(YEAR(E18)+0,MONTH(E18)+3,DAY(E18)+0)","v":"2024-03-31"},{"$f":"\"12/31/\"&\"\"&'Cover Page'!C$6","v":"12/31/2023"},{"$f":"DATE(YEAR(G18)+0,MONTH(G18)+3,DAY(G18)+0)","v":"2024-03-31"},{"$f":"\"12/31/\"&\"\"&'Cover Page'!C$6","v":"12/31/2023"},{"$f":"DATE(YEAR(I18)+0,MONTH(I18)+3,DAY(I18)+0)","v":"2024-03-31"},{"$f":"\"12/31/\"&\"\"&'Cover Page'!C$6","v":"12/31/2023"},{"$f":"DATE(YEAR(K18)+0,MONTH(K18)+3,DAY(K18)+0)","v":"2024-03-31"},{"$f":"\"12/31/\"&\"\"&'Cover Page'!C$6","v":"12/31/2023"},{"$f":"DATE(YEAR(M18)+0,MONTH(M18)+3,DAY(M18)+0)","v":"2024-03-31"},{"$f":"\"12/31/\"&\"\"&'Cover Page'!C$6","v":"12/31/2023"},{"$f":"DATE(YEAR(O18)+0,MONTH(O18)+3,DAY(O18)+0)","v":"2024-03-31"}]
[null,null,null,"INFORMATION ABOUT COMPLETING EACH COLUMN AND ROW.",1,2,3,4,5,6,7,8,9,10,11,12]
[null,"1.","Premium"]
[null,null,1.1000000000000001,"Total direct premium earned",{"$f":"'Pt 2 Premium and Claims'!E22+'Pt 2 Premium and Claims'!E23-'Pt 2 Premium and Claims'!E24-'Pt 2 Premium and Claims'!E25","v":0},{"$f":"'Pt 2 Premium and Claims'!F22+'Pt 2 Premium and Claims'!F23-'Pt 2 Premium and Claims'!F24-'Pt 2 Premium and Claims'!F25","v":0},{"$f":"'Pt 2 Premium and Claims'!G22+'Pt 2 Premium and Claims'!G23-'Pt 2 Premium and Claims'!G24-'Pt 2 Premium and Claims'!G25","v":0},{"$f":"'Pt 2 Premium and Claims'!H22+'Pt 2 Premium and Claims'!H23-'Pt 2 Premium and Claims'!H24-'Pt 2 Premium and Claims'!H25","v":0},{"$f":"'Pt 2 Premium and Claims'!I22+'Pt 2 Premium and Claims'!I23-'Pt 2 Premium and Claims'!I24-'Pt 2 Premium and Claims'!I25","v":0},{"$f":"'Pt 2 Premium and Claims'!J22+'Pt 2 Premium and Claims'!J23-'Pt 2 Premium and Claims'!J24-'Pt 2 Premium and Claims'!J25","v":0},{"$f":"'Pt 2 Premium and Claims'!K22+'Pt 2 Premium and Claims'!K23-'Pt 2 Premium and Claims'!K24-'Pt 2 Premium and Claims'!K25","v":0},{"$f":"'Pt 2 Premium and Claims'!L22+'Pt 2 Premium and Claims'!L23-'Pt 2 Premium and Claims'!L24-'Pt 2 Premium and Claims'!L25","v":0},{"$f":"'Pt 2 Premium and Claims'!M22+'Pt 2 Premium and Claims'!M23-'Pt 2 Premium and Claims'!M24-'Pt 2 Premium and Claims'!M25","v":70760.76999999999},{"$f":"'Pt 2 Premium and Claims'!N22+'Pt 2 Premium and Claims'!N23-'Pt 2 Premium and Claims'!N24-'Pt 2 Premium and Claims'!N25","v":70906.989999999991},{"$f":"'Pt 2 Premium and Claims'!O22+'Pt 2 Premium and Claims'!O23-'Pt 2 Premium and Claims'!O24-'Pt 2 Premium and Claims'!O25","v":0},{"$f":"'Pt 2 Premium and Claims'!P22+'Pt 2 Premium and Claims'!P23-'Pt 2 Premium and Claims'!P24-'Pt 2 Premium and Claims'!P25","v":0}]
[]
[null,"2.","Claims"]
[null,null,2.1,"Total incurred claims (MLR Form Part 2, Line 2.11)",{"$f":"'Pt 2 Premium and Claims'!E51","v":0},{"$f":"'Pt 2 Premium and Claims'!F51","v":0},{"$f":"'Pt 2 Premium and Claims'!G51","v":0},{"$f":"'Pt 2 Premium and Claims'!H51","v":0},{"$f":"'Pt 2 Premium and Claims'!I51","v":0},{"$f":"'Pt 2 Premium and Claims'!J51","v":0},{"$f":"'Pt 2 Premium and Claims'!K51","v":0},{"$f":"'Pt 2 Premium and Claims'!L51","v":0},{"$f":"'Pt 2 Premium and Claims'!M51","v":54347.387299999995},{"$f":"'Pt 2 Premium and Claims'!N51","v":47055.353299999988},{"$f":"'Pt 2 Premium and Claims'!O51","v":0},{"$f":"'Pt 2 Premium and Claims'!P51","v":0}]
[]
[null,"3.","Federal and State Taxes and Licensing or Regulatory Fees"]
[null,null,3.1,"Federal taxes and assessments incurred by the reporting health plan or health insurer during the MLR reporting year "]
[null,null,null,"  3.1 a  Federal income taxes deductible from premium in MLR calculations ",null,null,null,null,null,null,null,null,0,0]
[null,null,null,"  3.1 b  Other Federal Taxes (other than income tax) and assessments deductible from premium"]
[null,null,3.2,"State insurance, premium and other taxes incurred by the reporting health plan or heath insurer during the MLR reporting year (deductible from premium in MLR calculation)"]
[null,null,null,"  3.2 a   State income, excise, business, and other taxes"]
[null,null,null,"  3.2 b   State premium taxes ",null,null,null,null,null,null,null,null,1405,1659]
[null,null,null,"  3.2 c   Community benefit expenditures "]
[null,null,3.3,"Regulatory authority licenses and fees"]
[null,null,3.4,"Total Federal and State Taxes and fees to be excluded from premium",{"$f":"SUM(E$28:E$29,E$31,E$34+IF($H$6=\"No\",IF(MAX(E$32:E$33)=0,MIN(E$32:E$33),MAX(E$32:E$33)),SUM(E$32:E$33)))","v":0},0,0,0,0,0,0,0,1405,1659,0,0]
[]
[null,"4.","Non-Claims Costs "]
[null,null,4.0999999999999996,"Direct sales salaries and benefits"]
[null,null,4.2,"Agents and brokers fees and commissions",null,null,null,null,null,null,null,null,6014,7324]
[null,null,4.3,"Other taxes"]
[null,null,null,"4.3a   Taxes and assessments (exclude amounts reported in Section 3 or Line 10) \n"]
[null,null,null,"4.3b   Fines and penalties of regulatory authorities (exclude amounts reported in Line 3.3)"]
[null,null,4.4000000000000004,"Other general and administrative expenses",null,null,null,null,null,null,null,null,24988,31351]
[null,null,4.5,"Total non-claims costs",{"$f":"SUM(SUM(E38:E39)+SUM(E41:E43))","v":0},{"$f":"SUM(SUM(F38:F39)+SUM(F41:F43))","v":0},0,0,0,0,0,0,31002,38675,0,0]
[]
[null,"5.","Other Indicators or information "]
[null,null,5.0999999999999996,"Number of covered lives",null,null,null,null,null,null,null,null,119,120]
[null,null,5.2,"Member months",null,null,null,null,null,null,null,null,1422,1424]
[null,null,5.3,"Number of life-years",{"$f":"E48/12","v":0},{"$f":"F48/12","v":0},0,{"$f":"H48/12","v":0},0,0,0,0,{"$f":"M48/12","v":118.5},{"$f":"N48/12","v":118.66666666666667},0,0]
[null,null,null,null,{"$f":"\"Grand Total as of \"&\"\"&TEXT(E$18,\"MM/DD/YYYY\")&\" for ALL markets in col. 1-12.\"","v":"Grand Total as of 12/31/2023 for ALL markets in col. 1-12."}]
[null,"6.","Net investment income and other gain / (loss) "]
[null,"7.","Other Federal income taxes (exclude taxes on Line 3.1a and 3.1b) "]
[]
[null,"Cell Keys:"]
[null,null,"Blank cells require input from Health plan or Health insurer"]
[null,null,"Grey cells require no data input "]
[null,null,"Pink cells require no data input - locked down"]
[null,null,"Blue cells: computed cell (formula cell)"]

{"sheet":"Pt 2 Premium and Claims","index":2,"n_rows":58,"n_cols":16,"rows_kept":58,"cut":false,"hidden":false,"merged":[]}
[null,"Department of Managed Health Care/Department of Insurance"]
[null,"Medical Loss Ratio Reporting Form: Dental Coverage"]
[null,"Part 2 - Premium and Claims"]
[]
[null,"Health Plan ID"]
[null,null,null,{"$f":"'Cover Page'!C7","v":0}]
[null,"Legal Name"]
[null,null,null,{"$f":"'Cover Page'!C8","v":"Dearborn Life Insurance Company"}]
[null,"dBA",null,null,"Part 2"]
[null,null,null,{"$f":"'Cover Page'!C9","v":"Health Insurer"}]
[null,"MLR Reporting Year"]
[null,null,null,{"$f":"'Cover Page'!C6","v":"2023"}]
[]
[]
[null,null,null,null,null,null,"Health Insurance Coverage",null,null,null,null,null,"Health Insurance Coverage"]
[null,null,null,null,null,null,"DHMO Products",null,null,null,null,null,"DPPO & Indemnity Products"]
[null,null,null,null,"Individual",null,null,"Small Group","Large Group",null,"Individual",null,"Small Group",null,"Large Group"]
[null,null,null,null,"Total as of ","Total as of ","Total as of ","Total as of ","Total as of ","Total as of ","Total as of ","Total as of ","Total as of ","Total as of ","Total as of ","Total as of "]
[null,null,null,"Part 2\nNOTE: REFER TO MLR INSTRUCTIONS FOR IMPORTANT ",{"$f":"\"12/31/\"&\"\"&'Cover Page'!C$6","v":"12/31/2023"},{"$f":"DATE(YEAR(E19)+0,MONTH(E19)+3,DAY(E19)+0)","v":"2024-03-31"},{"$f":"\"12/31/\"&\"\"&'Cover Page'!C$6","v":"12/31/2023"},{"$f":"DATE(YEAR(G19)+0,MONTH(G19)+3,DAY(G19)+0)","v":"2024-03-31"},{"$f":"\"12/31/\"&\"\"&'Cover Page'!C$6","v":"12/31/2023"},{"$f":"DATE(YEAR(I19)+0,MONTH(I19)+3,DAY(I19)+0)","v":"2024-03-31"},{"$f":"\"12/31/\"&\"\"&'Cover Page'!C$6","v":"12/31/2023"},{"$f":"DATE(YEAR(K19)+0,MONTH(K19)+3,DAY(K19)+0)","v":"2024-03-31"},{"$f":"\"12/31/\"&\"\"&'Cover Page'!C$6","v":"12/31/2023"},{"$f":"DATE(YEAR(M19)+0,MONTH(M19)+3,DAY(M19)+0)","v":"2024-03-31"},{"$f":"\"12/31/\"&\"\"&'Cover Page'!C$6","v":"12/31/2023"},{"$f":"DATE(YEAR(O19)+0,MONTH(O19)+3,DAY(O19)+0)","v":"2024-03-31"}]
[null,null,null,"INFORMATION ABOUT COMPLETING EACH COLUMN AND ROW.",1,2,3,4,5,6,7,8,9,10,11,12]
[null,"1.","Premium:"]
[null,null,1.1000000000000001,"Direct premium written",null,null,null,null,null,null,null,null,70760.76999999999,70906.989999999991]
[null,null,1.2,"Unearned premium prior year"]
[null,null,1.3,"Unearned premium MLR Reporting year"]
[null,null,1.4,"Premium balances written off"]
[]
[null,"2.","Claims:"]
[null,null,2.1,"Claims Paid"]
[null,null,null,"2.1a  Claims paid during the MLR reporting year regardless of incurred date",null,null,null,null,null,null,null,null,51211.139999999992]
[null,null,null,"2.1b  Claims incurred only during the MLR reporting year, paid through 3/31 of the following year",null,null,null,null,null,null,null,null,null,46677.05999999999]
[null,null,2.2000000000000002,"Direct claim liability"]
[null,null,null,"2.2a Liability as of 12/31 of MLR reporting year for all claims regardless of incurred date"]
[null,null,null,"2.2b Liability for claims incurred only during the MLR reporting year, calculated as of 3/31 of the following year"]
[null,null,2.2999999999999998,"Direct claim liability prior year"]
[null,null,2.4,"Direct claim reserves"]
[null,null,null,"2.4a Reserves as of 12/31 of MLR reporting year for all claims regardless of incurred date",null,null,null,null,null,null,null,null,3136.2473]
[null,null,null,"2.4b Reserves for claims incurred only during the MLR reporting year, calculated as of 3/31 of the following year",null,null,null,null,null,null,null,null,null,378.29329999999999]
[null,null,2.5,"Direct claim reserves prior year"]
[null,null,2.6,"Experience rating refunds (rate credits) paid"]
[null,null,null,"2.6a Experience rating refunds, with all incurred dates, paid in the MLR reporting year"]
[null,null,null,"2.6b Experience rating refunds associated with premium earned only in the reporting year and paid through 3/31 of the following year"]
[null,null,2.7,"Reserve for experience rating refunds (rate credits)"]
[null,null,null,"2.7a Reserved in MLR reporting year regardless of incurred date"]
[null,null,null,"2.7b Reserves specific to the MLR reporting year through 3/31 of the following year"]
[null,null,"2.8","Reserve for experience rating refunds (rate credits) prior year"]
[null,null,2.9,"Incurred dental incentive pool and bonuses"]
[null,null,null,"2.9a  Paid dental incentive pools and bonuses MLR Reporting year"]
[null,null,null,"2.9b  Accrued dental incentive pools and bonuses MLR Reporting year"]
[null,null,null,"2.9c  Accrued dental incentive pools and bonuses prior year"]
[null,null,"2.10","Contingent benefit and lawsuit reserves"]
[null,null,"2.11","Total incurred claims ",{"$f":"E29+E32-E34+E36-E38+E40+E43-E45+E47+E48-E49+E50","v":0},{"$f":"F30+F33+F37+F41+F44+F47+F48+F50","v":0},{"$f":"G29+G32-G34+G36-G38+G40+G43-G45+G47+G48-G49+G50","v":0},{"$f":"H30+H33+H37+H41+H44+H47+H48+H50","v":0},{"$f":"I29+I32-I34+I36-I38+I40+I43-I45+I47+I48-I49+I50","v":0},{"$f":"J30+J33+J37+J41+J44+J47+J48+J50","v":0},{"$f":"K29+K32-K34+K36-K38+K40+K43-K45+K47+K48-K49+K50","v":0},{"$f":"L30+L33+L37+L41+L44+L47+L48+L50","v":0},{"$f":"M29+M32-M34+M36-M38+M40+M43-M45+M47+M48-M49+M50","v":54347.387299999995},{"$f":"N30+N33+N37+N41+N44+N47+N48+N50","v":47055.353299999988},{"$f":"O29+O32-O34+O36-O38+O40+O43-O45+O47+O48-O49+O50","v":0},{"$f":"P30+P33+P37+P41+P44+P47+P48+P50","v":0}]
[]
[]
[null,null,"Cell Keys:"]
[null,null,null,"Blank cells require input from Health plan or Health insurer"]
[null,null,null,"Grey cells require no data input"]
[null,null,null,"Pink cells require no data input - locked down"]
[null,null,null,"Blue cells: computed cell (formula cell)"]

{"sheet":"Pt 3 Expense Allocation","index":3,"n_rows":87,"n_cols":4,"rows_kept":87,"cut":false,"hidden":false,"merged":[]}
[null,"Department of Managed Health Care/Department of Insurance"]
[null,"Medical Loss Ratio Reporting Form: Dental Coverage "]
[null,"Part 3 - Expense Allocation"]
[]
[null,"Health Plan ID"]
[null,{"$f":"'Cover Page'!C7","v":0},null,"Part 3"]
[null,"Legal Name"]
[null,{"$f":"'Cover Page'!C8","v":"Dearborn Life Insurance Company"}]
[null,"dBA"]
[null,{"$f":"'Cover Page'!C9","v":"Health Insurer"}]
[null,"MLR Reporting Year"]
[null,{"$f":"'Cover Page'!C6","v":"2023"}]
[]
[]
[null,"Description of Expense Element (by Type)","NEW","Detailed Description of Expense Allocation Methods"]
[null,1,2,3]
[null,"1.  Incurred Claims"]
[null,null,null,"Actual - no allocation"]
[]
[]
[]
[]
[]
[null,"2.  Federal and State Taxes and Licensing or Regulatory Fees"]
[null,"2.a Federal taxes and assessments"]
[null,null,null,"Corporate tax rate 21%"]
[]
[]
[]
[]
[]
[null,"2.b State insurance, premium and other taxes"]
[null,null,null,"Actual premium tax allocated based on direct dental premium collected"]
[]
[]
[]
[]
[]
[null,"2.c Community benefit expenditures "]
[null,null,null,"None"]
[]
[]
[]
[]
[]
[null,"2.d Regulatory authority licenses and fees"]
[null,null,null,"None"]
[]
[]
[]
[]
[]
[null,"3.  Non-Claims costs"]
[null,"3.a Direct sales salaries and benefits"]
[null,null,null,"None"]
[]
[]
[]
[]
[]
[null,"3.b Agents and brokers fees and commissions"]
[null,null,null,"Actual expense allocated based on direct dental premium collected"]
[]
[]
[]
[]
[]
[null,"3.c Other taxes"]
[null,null,null,"no allocation"]
[]
[]
[]
[]
[]
[null,"3.d Other general and administrative expenses"]
[null,null,null,"Actual expense allocated based on direct dental premium collected"]
[]
[]
[]
[]
[]
[]
[null,"Cell Keys:"]
[null,"Blank cells require input from Health plan or Health insurer"]
[null,"Grey cells require no data input "]
[null,"Pink cells require no data input - locked down"]
[null,"Blue cells: computed cell (formula cell)"]

{"sheet":"Pt 4 MLR Calculation","index":4,"n_rows":41,"n_cols":28,"rows_kept":41,"cut":false,"hidden":false,"merged":[]}
[null,"Department of Managed Health Care/Department of Insurance"]
[null,"Medical Loss Ratio Reporting Form: Dental Coverage ",null,null,null,"",null,null,"",null,"",null,null,null,null,null,null,"",null,null,"",null,""]
[null,"Part 4 - MLR Calculation"]
[]
[null,"Health Plan ID"]
[null,null,null,{"$f":"'Cover Page'!C7","v":0},null,"Part 4"]
[null,"Legal Name"]
[null,null,null,{"$f":"'Cover Page'!C8","v":"Dearborn Life Insurance Company"}]
[null,"dBA"]
[null,null,null,{"$f":"'Cover Page'!C9","v":"Health Insurer"}]
[null,"MLR Reporting Year"]
[null,null,null,{"$f":"'Cover Page'!C6","v":"2023"}]
[]
[]
[null,null,null,null,null,null,null,null,null,"Health Insurance Coverage",null,null,null,null,null,null,null,null,null,null,null,"Health Insurance Coverage"]
[null,null,null,null,null,null,null,null,null,"DHMO Products",null,null,null,null,null,null,null,null,null,null,null,"DPPO & Indemnity Products"]
[null,null,null,null,null,"Individual",null,null,null,"Small Group",null,null,null,"Large Group",null,null,null,"Individual",null,null,null,"Small Group",null,null,null,"Large Group"]
[null,null,null,"Part 4\nNOTE: REFER TO MLR INSTRUCTIONS FOR IMPORTANT ","PY2","PY1","CY","Total ","PY2","PY1","CY","Total","PY2","PY1","CY","Total","PY2","PY1","CY","Total ","PY2","PY1","CY","Total","PY2","PY1","CY","Total"]
[null,null,null,"INFORMATION ABOUT COMPLETING EACH COLUMN AND ROW.",1,2,3,4,5,6,7,8,9,10,11,12,13,14,15,16,17,18,19,20,21,22,23,24]
[null,"1.","Medical Loss Ratio Numerator"]
[null,null,1.1000000000000001,"Adjusted incurred claims as reported on MLR Form for prior year(s)",null,null,null,null,null,null,null,null,null,null,null,null,null,null,null,null,147125.65599999996,123125.43999999997]
[null,null,1.2,"Adjusted incurred claims as of 3/31 of the year following the MLR reporting year (Part 1 Line 2.1)",null,null,{"$f":"'Pt 1 Summary of Data'!F24","v":0},{"$f":"SUM(E22:G22)","v":0},null,null,{"$f":"'Pt 1 Summary of Data'!H24","v":0},{"$f":"SUM(I22:K22)","v":0},null,null,{"$f":"'Pt 1 Summary of Data'!J24","v":0},{"$f":"SUM(M22:O22)","v":0},null,null,{"$f":"'Pt 1 Summary of Data'!L24","v":0},{"$f":"SUM(Q22:S22)","v":0},147125.65599999996,123125.43999999997,{"$f":"'Pt 1 Summary of Data'!N24","v":47055.353299999988},{"$f":"SUM(U22:W22)","v":317306.44929999986},null,null,{"$f":"'Pt 1 Summary of Data'!P24","v":0},{"$f":"SUM(Y22:AA22)","v":0}]
[null,null,1.3,"MLR numerator (Line 1.2)",{"$f":"SUM(E$22)","v":0},{"$f":"SUM(F$22)","v":0},{"$f":"SUM(G$22:G$22)","v":0},{"$f":"SUM(E23:G23)","v":0},{"$f":"SUM(I$22:I$22)","v":0},{"$f":"SUM(J$22:J$22)","v":0},{"$f":"SUM(K$22:K$22)","v":0},{"$f":"SUM(I23:K23)","v":0},{"$f":"SUM(M$22:M$22)","v":0},{"$f":"SUM(N$22:N$22)","v":0},{"$f":"SUM(O$22:O$22)","v":0},{"$f":"SUM(M23:O23)","v":0},{"$f":"SUM(Q$22:Q$22)","v":0},{"$f":"SUM(R$22:R$22)","v":0},{"$f":"SUM(S$22:S$22)","v":0},{"$f":"SUM(Q23:S23)","v":0},{"$f":"SUM(U$22:U$22)","v":147125.65599999996},{"$f":"SUM(V$22:V$22)","v":123125.43999999997},{"$f":"SUM(W$22:W$22)","v":47055.353299999988},{"$f":"SUM(U23:W23)","v":317306.44929999986},{"$f":"SUM(Y$22:Y$22)","v":0},{"$f":"SUM(Z$22:Z$22)","v":0},{"$f":"SUM(AA$22:AA$22)","v":0},{"$f":"SUM(Y23:AA23)","v":0}]
[null,null,null,"  "]
[null,"2.","Medical Loss Ratio Denominator"]
[null,null,2.1,"Premium earned (Part 1 Line 1.1)",null,null,{"$f":"'Pt 1 Summary of Data'!F21","v":0},{"$f":"SUM(E26:G26)","v":0},null,null,{"$f":"'Pt 1 Summary of Data'!H21","v":0},{"$f":"SUM(I26:K26)","v":0},null,null,{"$f":"'Pt 1 Summary of Data'!J21","v":0},{"$f":"SUM(M26:O26)","v":0},null,null,{"$f":"'Pt 1 Summary of Data'!L21","v":0},{"$f":"SUM(Q26:S26)","v":0},296474.90919999999,201390.462,{"$f":"'Pt 1 Summary of Data'!N21","v":70906.989999999991},{"$f":"SUM(U26:W26)","v":568772.36119999993},null,null,{"$f":"'Pt 1 Summary of Data'!P21","v":0},{"$f":"SUM(Y26:AA26)","v":0}]
[null,null,2.2000000000000002,"Federal and State taxes and licensing or regulatory fees ( Part 1 Line 3.4)",null,null,{"$f":"'Pt 1 Summary of Data'!F35","v":0},{"$f":"SUM(E27:G27)","v":0},null,null,{"$f":"'Pt 1 Summary of Data'!H35","v":0},{"$f":"SUM(I27:K27)","v":0},null,null,{"$f":"'Pt 1 Summary of Data'!J35","v":0},{"$f":"SUM(M27:O27)","v":0},null,null,{"$f":"'Pt 1 Summary of Data'!L35","v":0},{"$f":"SUM(Q27:S27)","v":0},null,10502,{"$f":"'Pt 1 Summary of Data'!N35","v":1659},{"$f":"SUM(U27:W27)","v":12161},null,null,{"$f":"'Pt 1 Summary of Data'!P35","v":0},{"$f":"SUM(Y27:AA27)","v":0}]
[null,null,2.2999999999999998,"MLR Denominator (Line 2.1 - Line 2.2) ",{"$f":"E$26-E$27","v":0},0,0,{"$f":"H$26-H$27","v":0},{"$f":"I$26-I$27","v":0},{"$f":"J$26-J$27","v":0},0,{"$f":"L$26-L$27","v":0},0,0,0,{"$f":"P$26-P$27","v":0},0,0,0,{"$f":"T$26-T$27","v":0},296474.90919999999,190888.462,69247.989999999991,{"$f":"X$26-X$27","v":556611.36119999993},0,0,0,{"$f":"AB$26-AB$27","v":0}]
[]
[null,"3.",3.1,"Life-years (Part 1 Line 5.3)",null,null,{"$f":"'Pt 1 Summary of Data'!F49","v":0},{"$f":"SUM(E30:G30)","v":0},null,null,{"$f":"'Pt 1 Summary of Data'!H49","v":0},{"$f":"SUM(I30:K30)","v":0},null,null,{"$f":"'Pt 1 Summary of Data'!J49","v":0},{"$f":"SUM(M30:O30)","v":0},null,null,{"$f":"'Pt 1 Summary of Data'!L49","v":0},{"$f":"SUM(Q30:S30)","v":0},458.58333333333331,325,{"$f":"'Pt 1 Summary of Data'!N49","v":118.66666666666667},{"$f":"SUM(U30:W30)","v":902.24999999999989},null,null,{"$f":"'Pt 1 Summary of Data'!P49","v":0},{"$f":"SUM(Y30:AA30)","v":0}]
[]
[null,"4.",null,"MLR Calculation (for Health plans or health insurers with at least 1,000 life years in the Total column of Line 3.1)"]
[null,null,4.0999999999999996,"MLR",null,null,null,{"$f":"IF(H30<1000,\"Not Required to Calculate\",H23/H28)","v":"Not Required to Calculate"},null,null,null,{"$f":"IF(L30<1000,\"Not Required to Calculate\",L23/L28)","v":"Not Required to Calculate"},null,null,null,{"$f":"IF(P30<1000,\"Not Required to Calculate\",P23/P28)","v":"Not Required to Calculate"},null,null,null,{"$f":"IF(T30<1000,\"Not Required to Calculate\",T23/T28)","v":"Not Required to Calculate"},null,null,null,{"$f":"IF(X30<1000,\"Not Required to Calculate\",X23/X28)","v":"Not Required to Calculate"},null,null,null,{"$f":"IF(AB30<1000,\"Not Required to Calculate\",AB23/AB28)","v":"Not Required to Calculate"}]
[]
[]
[]
[null,null,"Cell Keys:"]
[null,null,null,"Blank cells require input from Health plan or Health insurer"]
[null,null,null,"Grey cells require no data input "]
[null,null,null,"Pink cells require no data input - locked down"]
[null,null,null,"Blue cells: computed cell (formula cell)"]

{"sheet":"Pt 5 Additional Responses","index":5,"n_rows":49,"n_cols":3,"rows_kept":49,"cut":false,"hidden":false,"merged":[]}
[null,"Department of Managed Health Care/Department of Insurance"]
[null,"Medical Loss Ratio Reporting Form: Dental Coverage "]
[null,"Part 5 - Additional Responses"]
[]
[null,"Health Plan ID"]
[null,{"$f":"'Cover Page'!C7","v":0}]
[null,"Legal Name","Part 5"]
[null,{"$f":"'Cover Page'!C8","v":"Dearborn Life Insurance Company"}]
[null,"dBA"]
[null,{"$f":"'Cover Page'!C9","v":"Health Insurer"}]
[null,"MLR Reporting Year"]
[null,{"$f":"'Cover Page'!C6","v":"2023"}]
[]
[]
[]
[null,null,"Tax Rate "]
[null,"1. If a health plan or health insurer uses the hightest premium tax rate in the State, the health plan or health insurer must report applicabe highest State health premium tax rate."]
[null,"2. If the health plan or health insurer included deferred experience for prior year and excluded deferred experience for current year, provide the total direct written premium and total incurred claims for the deferred experience by market."]
[null,"Deferred experience for prior year"]
[null,"Deferred experience for current year"]
[]
[]
[]
[]
[]
[]
[]
[]
[]
[]
[]
[null,"3. If the health plan or health insurer novated any business in the MLR reporting year effective during the reporting year provide the name of the entity to whom the business was sold or transferred and the date of the sale or transfer."]
[null,"Name of Entity to whom business was sold or transferred","Effective date of sale or transfer"]
[]
[]
[]
[]
[]
[]
[]
[]
[]
[]
[]
[null,"Cell Keys:"]
[null,"Blank cells require input from Health plan or Health insurer"]
[null,"Grey cells require no data input "]
[null,"Pink cells require no data input - locked down"]
[null,"Blue cells: computed cell (formula cell)"]

{"sheet":"Attestation","index":6,"n_rows":29,"n_cols":4,"rows_kept":29,"cut":false,"hidden":false,"merged":[]}
[null,"Department of Managed Health Care"]
[null,"Medical Loss Ratio Reporting Form: Dental Coverage "]
[null,"Attestation"]
[]
[null,"Health Plan ID"]
[null,{"$f":"'Cover Page'!C7","v":0}]
[null,"Legal Name"]
[null,{"$f":"'Cover Page'!C8","v":"Dearborn Life Insurance Company"},null,"Attestation"]
[null,"dBA"]
[null,{"$f":"'Cover Page'!C9","v":"Health Insurer"}]
[null,"MLR Reporting Year"]
[null,{"$f":"'Cover Page'!C6","v":"2023"}]
[]
[]
[]
[]
[null,"Attestation Statement"]
[null,"The officers of this reporting Health plan being duly sworn, each attest that he/she is the described officer of the reporting Health plan, and that this MLR Reporting Form, the Company/Health plan Associations, and any supplemental submission that the Health plan includes are full and true statements of all the elements included therein for the MLR reporting year stated above, and that the MLR Reporting Form has been completed in accordance with the Department of Managed Health Care’s guidance and reporting instructions, according to the best of his/her information, knowledge and belief.  Furthermore, the scope of this attestation by the described officer includes any related electronic filings and postings for the MLR reporting year stated above and which are required by Department of Managed Health Care."]
[]
[]
[]
[]
[null,"Chief Executive Officer/President"]
[]
[null,"Mike W. Witwer"]
[]
[null,"Chief Financial Officer"]
[]
[null,"Claire C. Burke"]

{"sheet":"Dec 2023","index":7,"n_rows":57,"n_cols":21,"rows_kept":57,"cut":false,"hidden":false,"merged":[[1,0,1,1],[44,0,44,1],[52,0,52,1],[54,0,54,1],[56,0,56,1]]}
["DEARBORN LIFE INSURANCE COMPANY",null,null,null,null,null,null,null,null,"DO NOT FILE THIS PAGE"]
["DECEMBER 2023 YTD"]
["INCOME STATEMENT BY LINE OF BUSINESS"]
["$'(000)'s"]
[]
[null,null,null,"Regional Accounts Group Insurance"]
[null,null,null,"Life","ADD","STD","LTD","Dental","Critical Illness","Accident","Hosp Indem","Vision","STD ASO","LTD ASO","DENTAL ASO","TOTAL"]
[]
["Revenues"]
["Premiums"]
[null,"Insurance premiums",null,171391.35680000001,18375.755349999999,89828.350390000007,82445.849429999987,1075.8941200000002,7183.4588999999996,7202.5658800000001,0,44499.552320000003,0,0,0,422002.78319000005]
[null,"ASO claims and fees",null,500.18120999999996,0,0,0,0,0,0,0,0,3819.5487199999998,0,0,4319.7299299999995]
[null,"Annuity premiums",null,0,0,0,0,0,0,0,0,0,0,0,0,0]
[null,"   Total premiums",null,171891.53801000002,18375.755349999999,89828.350390000007,82445.849429999987,1075.8941200000002,7183.4588999999996,7202.5658800000001,0,44499.552320000003,3819.5487199999998,0,0,426322.51312000002]
[]
["Net investment income",null,null,3566,0,548,10631,3,0,0,0,0,0,0,0,14748]
["Realized capital gains (losses) on bond disposals",null,null,0,0,0,0,0,0,0,0,0,0,0,0,0]
["Realized capital gains (losses) on derivatives",null,null,0,0,0,0,0,0,0,0,0,0,0,0,0]
["Realized capital losses - impairments",null,null,-455,0,-52,-1012,null,0,0,0,0,0,0,0,-1519]
[]
["Other income"]
[null,"Dental TPA fees"]
[null,"Dental network leasing fees"]
[null,"Other revenues",null,84.714060000000003,0,1117.2973599999998,2.2646899999999999,0,0,0,0,0,0,0,0,1204.2761099999998]
[null,"   Total other income",null,84.714060000000003,0,1117.2973599999998,2.2646899999999999,0,0,0,0,0,0,0,0,1204.2761099999998]
[]
["   Gross Revenues",null,null,175087.25207000002,18375.755349999999,91441.647750000004,92067.114119999984,1078.8941200000002,7183.4588999999996,7202.5658800000001,0,44499.552320000003,3819.5487199999998,0,0,440755.78922999999]
[]
["Less: ASO claims",null,null,0,0,0,0,0,0,0,0,0,-2825.7256499999999,0,0,-2825.7256499999999]
[]
["Net Revenues",null,null,175087.25207000002,18375.755349999999,91441.647750000004,92067.114119999984,1078.8941200000002,7183.4588999999996,7202.5658800000001,0,44499.552320000003,993.82306999999992,0,0,437930.06358000002]
[]
["Incurred Benefits"]
[null,"Insurance claims and reserves",null,113011.86339,5954.9396399999996,50415.928229999998,54495.612329999989,682.67475999999999,1604.6046200000001,778.85229000000004,0,22195.058500000003,0,0,0,249139.53376000002]
[null,"Annuity claims and reserves",null,0,0,0,0,0,0,null,null,null,0,0,0,0]
["Total Incurred Benefits",null,null,113011.86339,5954.9396399999996,50415.928229999998,54495.612329999989,682.67475999999999,1604.6046200000001,778.85229000000004,0,22195.058500000003,0,0,0,249139.53376000002,null,"CA DENTAL","CA DENTAL","CA DENTAL"]
[null,null,null,null,null,null,null,null,null,null,null,null,null,null,null,null,null,"2023-12-31","03/312023","2024-03-31"]
["Operating Expenses"]
[null,"Commission expense",null,23910.173699999999,2417.4492,13971.642609999999,12879.708049999999,110.20771000000001,1409.2079199999998,1155.7624499999999,0,5528.3053300000001,53.494450000000001,0,0,61435.951420000005,{"$f":"+I39/P39","v":2.2937838308486631E-2},{"$f":"+H39*1000","v":110207.71},{"$f":"'March 2023'!H39*1000","v":30904.55},{"$f":"'March 2024'!H39*1000","v":23792.2},{"$f":"+R39-S39+T39","v":103095.36}]
[null,"General and administrative expense",null,21202.354625208853,2667.0340662647286,19612.107991358891,13817.05373947979,457.92399999999998,2037.5850662244959,1907.7745915714672,{"$error":"#DIV/0!"},6215.0512997214419,190.97743600000001,0,0,68107.862815829663,{"$f":"+I40/P40","v":2.9917031337987007E-2},{"$f":"+H40*1000","v":457924},{"$f":"'March 2023'!H40*1000","v":85896},{"$f":"'March 2024'!H40*1000","v":69263.309999999983},441291.31]
[null,"ACA tax",null,0,null,0,0,null,0,0,0,null,0,0,0,0]
[null,"Premium tax",null,2169.8734606863732,234.30176746787959,1134.6647464781752,1147.2904190403833,13.729340662137743,90.574660162549037,87.983751480879292,0,553.40255274596825,0,0,0,5431.8206987243448,"DENTAL PREM",59805,10069,20842,{"$f":"+R42-S42+T42","v":70578}]
["Total Operating Expenses",null,null,47282.401785895228,5318.7850337326081,34718.415347837064,27844.05220852017,581.8610506621377,3537.3676463870447,3151.5207930523461,{"$error":"#DIV/0!"},12296.759182467411,244.47188600000001,0,0,134975.63493455399,"CA PREM TX RATE .0235",{"$f":"+R42*0.0235","v":1405.4175},null,null,{"$f":"+U42*0.0235","v":1658.5830000000001}]
[null,null,null,null,null,null,null,null,null,null,null,null,null,null,null,null,"DENTAL PREMIUM - ALL STATES",1095977,314116,211594,{"$f":"+R44-S44+T44","v":993455}]
["Total Incurred Benefits and Operating Expenses",null,null,160294.26517589524,11273.724673732608,85134.343577837062,82339.664538520155,1264.5358106621377,5141.9722663870452,3930.3730830523464,{"$error":"#DIV/0!"},34491.817682467416,244.47188600000001,0,0,384115.16869455401,null,{"$f":"+R42/R44","v":5.4567750965576832E-2},null,null,{"$f":"+U42/U44","v":7.1042976279750966E-2}]
[null,null,null,null,null,null,null,null,null,null,null,null,null,null,null,null,"Agents and brokers fees and commissions",{"$f":"+R45*R39","v":6013.7868737665121},null,null,{"$f":"+U45*U39","v":7324.2012150323862}]
["Pre-tax Income (Loss) Before TB & C&S Allocation",null,null,14792.986894104775,7102.0306762673918,6307.3041721629415,9727.4495814798283,-185.64169066213753,2041.4866336129544,3272.1927969476537,{"$error":"#DIV/0!"},10007.734637532587,749.35118399999988,0,0,53814.894885446003,"General and administrative expense",{"$f":"+R45*R40","v":24987.882793160807},null,null,{"$f":"+U45*U40","v":31350.648068790229}]
["C&S Earnings Allocation",null,null,4995.6037743563702,76.034081540621415,284.22110901098296,1783.0286178945016,13.324768199999999,38.211689025160474,46.884867897085066,0,248.0928432418176,0,0,0,7485.4017511665406,"Premium tax",{"$f":"+R43","v":1405.4175},null,null,{"$f":"+U43","v":1658.5830000000001}]
["Pre-tax Income (Loss) Before Total Blue Costs"]
[null,null,null,null,null,null,null,null,null,null,null,null,null,null,null,null,"EARNED PREMIUM ( PER REPORT)",70761,null,null,70907]
["Pre-tax Income (Loss) ",null,null,19788.590668461147,7178.0647578080134,6591.5252811739247,11510.478199374331,-172.31692246213754,2079.6983226381149,3319.0776648447386,{"$error":"#DIV/0!"},10255.827480774404,749.35118399999988,0,0,61300.296636612547,"INCURRED CLAIMS ( PER REPORT)",54347,null,null,47055]
[null,null,null,null,null,null,null,null,null,null,null,null,null,null,null,null,"NET INCOME",{"$f":"+R50-R51-R46-R47-R48","v":-15993.087166927318},null,null,{"$f":"+U50-U51-U46-U47-U48","v":-16481.432283822614}]
["Insurance loss ratio (insurance benefit expenses / insurance premiums)",null,null,0.65937901128745835,0.32406502625754646,0.56124740141740892,0.66098672894708987,0.63451853422156435,0.2233749287547257,0.10813539271646343,{"$error":"#DIV/0!"},0.49877037729264062,{"$error":"#DIV/0!"},{"$error":"#DIV/0!"},{"$error":"#DIV/0!"},0.59037414842790004,"FIT @21%",{"$f":"+R52*0.21","v":-3358.5483050547368},null,null,{"$f":"+U52*0.21","v":-3461.1007796027488}]
[]
["G&A Expense ratio (G&A expenses / insurance premiums incl. ASO)",null,null,0.12334728556547896,0.14513874480075339,0.2183287114392137,0.16758944003859227,0.42562180746930739,0.28364957530758561,0.26487429943111707,{"$error":"#DIV/0!"},0.13966547921715006,0.05,{"$error":"#DIV/0!"},{"$error":"#DIV/0!"},0.15975666477800776]
[]
["Pre-tax Margin (Pre-tax income (loss) / total premiums)",null,null,0.1151225412114814,0.39062692232719637,7.3379119760699912E-2,0.13961258546007477,-0.16016159885894488,0.2895121071324171,0.46081878599140819,{"$error":"#DIV/0!"},0.23047035185936007,0.19618840835207357,{"$error":"#DIV/0!"},{"$error":"#DIV/0!"},0.14378855150761866]

{"sheet":"March 2023","index":8,"n_rows":57,"n_cols":15,"rows_kept":57,"cut":false,"hidden":false,"merged":[[1,0,1,1],[44,0,44,1],[52,0,52,1],[54,0,54,1],[56,0,56,1]]}
["DEARBORN LIFE INSURANCE COMPANY",null,null,null,null,null,null,null,null,"DO NOT FILE THIS PAGE"]
["MARCH 2023 YTD"]
["INCOME STATEMENT BY LINE OF BUSINESS"]
["$'(000)'s"]
[]
[null,null,null,"Regional Accounts Group Insurance"]
[null,null,null,"Life","ADD","STD","LTD","Dental","Critical Illness","Accident","Vision","STD ASO","LTD ASO","DENTAL ASO","TOTAL"]
[]
["Revenues"]
["Premiums"]
[null,"Insurance premiums",null,42363.381609999997,4542.2990899999995,22247.84762,20330.598620000001,277.63130000000007,1715.2528800000002,1713.7324199999998,10637.20091,0,0,0,103827.94445]
[null,"ASO claims and fees",null,137.53676999999999,0,0,0,0,0,0,0,921.13049000000001,0,0,1058.6672599999999]
[null,"Annuity premiums",null,0,0,0,0,0,0,0,0,0,0,0,0]
[null,"   Total premiums",null,42500.918379999996,4542.2990899999995,22247.84762,20330.598620000001,277.63130000000007,1715.2528800000002,1713.7324199999998,10637.20091,921.13049000000001,0,0,104886.61171]
[]
["Net investment income",null,null,933,0,132,2580,1,0,0,0,0,0,0,3646]
["Realized capital gains (losses) on bond disposals",null,null,0,0,0,0,0,0,0,0,0,0,0,0]
["Realized capital gains (losses) on derivatives",null,null,0,0,0,0,0,0,0,0,0,0,0,0]
["Realized capital losses - impairments",null,null,0,0,0,0,null,0,0,0,0,0,0,0]
[]
["Other income"]
[null,"Dental TPA fees"]
[null,"Dental network leasing fees"]
[null,"Other revenues",null,86.328860000000006,0,269.29556000000002,0.31989999999999996,0,0,0,0,0,0,0,355.94432000000006]
[null,"   Total other income",null,86.328860000000006,0,269.29556000000002,0.31989999999999996,0,0,0,0,0,0,0,355.94432000000006]
[]
["   Gross Revenues",null,null,43520.247239999997,4542.2990899999995,22649.143179999999,22910.918519999999,278.63130000000007,1715.2528800000002,1713.7324199999998,10637.20091,921.13049000000001,0,0,108888.55602999999]
[]
["Less: ASO claims",null,null,0,0,0,0,0,0,0,0,-681.0009399999999,0,0,-681.0009399999999]
[]
["Net Revenues",null,null,43520.247239999997,4542.2990899999995,22649.143179999999,22910.918519999999,278.63130000000007,1715.2528800000002,1713.7324199999998,10637.20091,240.12955000000011,0,0,108207.55508999999]
[]
["Incurred Benefits"]
[null,"Insurance claims and reserves",null,35174.813540000003,1677.5783900000001,12530.95551,11429.802549999999,203.18635,223.89867000000001,147.96634,5620.9804699999995,0,0,0,67009.181820000013]
[null,"Annuity claims and reserves",null,0,0,0,0,0,0,null,null,0,0,0,0]
["Total Incurred Benefits",null,null,35174.813540000003,1677.5783900000001,12530.95551,11429.802549999999,203.18635,223.89867000000001,147.96634,5620.9804699999995,0,0,0,67009.181820000013]
[]
["Operating Expenses"]
[null,"Commission expense",null,6357.1661899999999,612.09202000000005,3522.1464700000001,3274.1009300000001,30.90455,341.86039999999997,278.67725999999999,1338.4498000000001,11.116200000000001,0,0,15766.51382]
[null,"General and administrative expense",null,5731.5635783542848,741.40099932704254,5298.1300934167039,3352.8817161323127,85.896000000000001,542.96867957144457,508.02371229742317,1560.1098644953752,91.446788000000012,0,0,17912.421431594586]
[null,"ACA tax",null,0,null,0,0,null,0,0,null,0,0,0,0]
[null,"Premium tax",null,524.83776442643955,58.106525492920085,288.32781394919073,294.76654755101356,3.9175330806611743,22.555148361011508,20.218358018861885,132.39398687649103,0,0,0,1345.1236777565896]
["Total Operating Expenses",null,null,12613.567532780726,1411.5995448199626,9108.6043773658948,6921.7491936833267,120.71808308066117,907.38422793245604,806.91933031628503,3030.9536513718663,102.56298800000002,0,0,35024.058929351173]
[]
["Total Incurred Benefits and Operating Expenses",null,null,47788.381072780729,3089.1779348199625,21639.559887365896,18351.551743683325,323.90443308066119,1131.2828979324561,954.88567031628509,8651.9341213718653,102.56298800000002,0,0,102033.24074935119]
[]
["Pre-tax Income (Loss) Before TB & C&S Allocation",null,null,-4268.1338327807316,1453.121155180037,1009.5832926341027,4559.3667763166741,-45.273133080661125,583.96998206754415,758.84674968371473,1985.2667886281342,137.56656200000009,0,0,6174.3143406488089]
["C&S Earnings Allocation",null,null,943.81670944576183,15.018251135612328,55.660739413124816,349.50629000805941,2.6016182999999997,7.4238642808428708,9.1251713426775893,48.06239185010196,0,0,0,1431.2150357761807]
["Pre-tax Income (Loss) Before Total Blue Costs"]
[]
["Pre-tax Income (Loss) ",null,null,-3324.3171233349699,1468.1394063156492,1065.2440320472274,4908.8730663247334,-42.671514780661127,591.393846348387,767.97192102639235,2033.3291804782361,137.56656200000009,0,0,7605.5293764249891]
[]
["Insurance loss ratio (insurance benefit expenses / insurance premiums)",null,null,0.83031175045990402,0.36932363033804544,0.56324349770964488,0.56219704907046153,0.73185678271866306,0.13053391287703303,8.6341565505308013E-2,0.5284266526089334,{"$error":"#DIV/0!"},{"$error":"#DIV/0!"},{"$error":"#DIV/0!"},0.64538677111410359]
[]
["G&A Expense ratio (G&A expenses / insurance premiums incl. ASO)",null,null,0.13485740536494933,0.16322152826951838,0.23814124331982026,0.16491800260293135,0.30938874687400153,0.31655313680128871,0.29644284391691861,0.14666545059130365,9.9276692056952762E-2,{"$error":"#DIV/0!"},{"$error":"#DIV/0!"},0.17077891200375955]
[]
["Pre-tax Margin (Pre-tax income (loss) / total premiums)",null,null,-7.8217536233271628E-2,0.32321504533855988,4.788076807437372E-2,0.24145246079944169,-0.1536985015041932,0.3447852227762398,0.44812825623406977,0.19115265356760439,0.14934535713827049,{"$error":"#DIV/0!"},{"$error":"#DIV/0!"},7.2511917893328892E-2]

{"sheet":"March 2024","index":9,"n_rows":57,"n_cols":16,"rows_kept":57,"cut":false,"hidden":false,"merged":[[1,0,1,1],[44,0,44,1],[52,0,52,1],[54,0,54,1],[56,0,56,1]]}
["DEARBORN LIFE INSURANCE COMPANY",null,null,null,null,null,null,null,null,"DO NOT FILE THIS PAGE"]
["MARCH 2024 YTD"]
["INCOME STATEMENT BY LINE OF BUSINESS"]
["$'(000)'s"]
[]
[null,null,null,"Regional Accounts Group Insurance"]
[null,null,null,"Life","ADD","STD","LTD","Dental","Critical Illness","Accident","Hosp Indem","Vision","STD ASO","LTD ASO","DENTAL ASO","TOTAL"]
[]
["Revenues"]
["Premiums"]
[null,"Insurance premiums",null,43989.657209999998,4716.8598899999997,23384.227619999998,20675.638079999997,211.69790000000003,1936.7313400000003,1919.00396,244.18995999999999,13039.912000000002,null,0,0,110117.91795999999]
[null,"ASO claims and fees",null,115.33028,0,0,0,0,0,0,0,0,1004.42752,0,0,1119.7577999999999]
[null,"Annuity premiums",null,0,0,0,0,0,0,0,0,0,0,0,0,0]
[null,"   Total premiums",null,44104.98749,4716.8598899999997,23384.227619999998,20675.638079999997,211.69790000000003,1936.7313400000003,1919.00396,244.18995999999999,13039.912000000002,1004.42752,0,0,111237.67576]
[]
["Net investment income",null,null,849,0,137,2881,1,0,0,0,0,0,0,0,3868]
["Realized capital gains (losses) on bond disposals",null,null,0,0,0,0,0,0,0,0,0,0,0,0,0]
["Realized capital gains (losses) on derivatives",null,null,0,0,0,0,0,0,0,0,0,0,0,0,0]
["Realized capital losses - impairments",null,null,0,0,0,0,null,0,0,0,0,0,0,0,0]
[]
["Other income"]
[null,"Dental TPA fees"]
[null,"Dental network leasing fees"]
[null,"Other revenues",null,0.85438000000000003,0,311.36484000000002,0.57591999999999999,0,0,0,0,0,0,0,0,312.79514]
[null,"   Total other income",null,0.85438000000000003,0,311.36484000000002,0.57591999999999999,0,0,0,0,0,0,0,0,312.79514]
[]
["   Gross Revenues",null,null,44954.841869999997,4716.8598899999997,23832.592459999996,23557.213999999996,212.69790000000003,1936.7313400000003,1919.00396,244.18995999999999,13039.912000000002,1004.42752,0,0,115418.4709]
[]
["Less: ASO claims",null,null,-10,0,0,0,0,0,0,0,0,-768.42650000000003,0,0,-778.42650000000003]
[]
["Net Revenues",null,null,44944.841869999997,4716.8598899999997,23832.592459999996,23557.213999999996,212.69790000000003,1936.7313400000003,1919.00396,244.18995999999999,13039.912000000002,236.00101999999993,0,0,114640.0444]
[]
["Incurred Benefits"]
[null,"Insurance claims and reserves",null,25311.604310000002,-88.55506999999983,12433.61536,13007.426890000001,116.13592,163.95795000000001,226.00128000000001,142.08799999999999,7370.7418299999999,null,0,0,58683.01647000001]
[null,"Annuity claims and reserves",null,0,0,0,0,0,0,null,null,null,0,0,0,0]
["Total Incurred Benefits",null,null,25311.604310000002,-88.55506999999983,12433.61536,13007.426890000001,116.13592,163.95795000000001,226.00128000000001,142.08799999999999,7370.7418299999999,0,0,0,58683.01647000001]
[]
["Operating Expenses"]
[null,"Commission expense",null,6393.1287999999986,673.54122999999993,3547.2941800000003,3329.18334,23.792200000000001,359.64213999999998,353.17318999999998,0,1548.89645,null,0,0,16228.651529999999]
[null,"General and administrative expense",null,6712.3206686637559,889.53684383734958,5744.9205880166246,3636.4174518137775,69.26330999999999,531.44163090662562,604.73394279137472,201.9152,1834.0907528082519,50.221376000000006,0,0,20274.861764837759]
[null,"ACA tax",null,0,null,0,0,null,0,0,0,null,0,0,0,0]
[null,"Premium tax",null,535.02346037361917,59.012111054079455,257.36838286597612,79.72398682170649,2.6219055611642652,22.896519426802207,21.676546732162869,2.8814415280000008,152.0741318476494,0,0,0,1133.27848621116]
["Total Operating Expenses",null,null,13640.472929037374,1622.0901848914291,9549.5831508826013,7045.3247786354841,95.677415561164267,913.98029033342789,979.58367952353751,204.79664152800001,3535.0613346559012,50.221376000000006,0,0,37636.791781048916]
[]
["Total Incurred Benefits and Operating Expenses",null,null,38952.077239037375,1533.5351148914292,21983.198510882601,20052.751668635487,211.81333556116425,1077.938240333428,1205.5849595235375,346.88464152799997,10905.803164655901,50.221376000000006,0,0,96319.808251048933]
[]
["Pre-tax Income (Loss) Before TB & C&S Allocation",null,null,5992.7646309626216,3183.3247751085705,1849.3939491173951,3504.4623313645097,0.88456443883578117,858.79309966657229,713.41900047646254,-102.69468152799999,2134.108835344101,185.77964399999991,0,0,18320.236148951066]
["C&S Earnings Allocation",null,null,1045.9978168723117,15.716679898237144,53.232918628222649,355.02618936319567,1.7383370818816104,10.654831423825001,12.931345818086465,0,72.762474951856603,0,0,0,1568.0605940376167]
["Pre-tax Income (Loss) Before Total Blue Costs"]
[]
["Pre-tax Income (Loss) ",null,null,7038.7624478349335,3199.0414550068076,1902.6268677456178,3859.4885207277052,2.6229015207173916,869.44793109039733,726.35034629454901,-102.69468152799999,2206.8713102959578,185.77964399999991,0,0,19888.296742988681]
[]
["Insurance loss ratio (insurance benefit expenses / insurance premiums)",null,null,0.57539898956625679,-1.8774157398175301E-2,0.53170947366958621,0.62911852295298076,0.548592687976593,8.4657043862366568E-2,0.11777009569068321,0.58187486496168805,0.56524475241857453,{"$error":"#DIV/0!"},{"$error":"#DIV/0!"},{"$error":"#DIV/0!"},0.532910697524416]
[]
["G&A Expense ratio (G&A expenses / insurance premiums incl. ASO)",null,null,0.15218960599831599,0.18858665819674147,0.24567501999095856,0.17587933381999779,0.32717995785503767,0.27440131727647138,0.31512907497667419,0.82687756695647929,0.14065208053614561,5.000000000000001E-2,{"$error":"#DIV/0!"},{"$error":"#DIV/0!"},0.18226613983360845]
[]
["Pre-tax Margin (Pre-tax income (loss) / total premiums)",null,null,0.15959107684660026,0.67821422081858951,8.1363682335966678E-2,0.18666841167340195,1.2389832495822543E-2,0.44892542044081202,0.37850382877508443,-0.42055243191816732,0.16923973952400578,0.18496072668339464,{"$error":"#DIV/0!"},{"$error":"#DIV/0!"},0.17879101309073128]